{"text_format":"1","workbook":"xlsx","n_sheets":7,"sheets":["Ark4","Forside","Budget 2021","Bogføring 2021","Overblik årsregnskab","Kontoplan til print","Aktiviteter"],"not_rendered":{"charts":0,"images":2,"macros":1,"external_links":0,"defined_names":3,"comments":1,"pivot_tables":4},"unopened":[],"bounds":{"document_bytes":16777216,"sheet_cells":100000,"rows_first":2000,"rows_last":500,"rows_between":2000,"halvings":0,"cell_chars":16384,"cell_head_chars":4096},"cells_cut":0,"cells_raw":0,"read":"whole","date_system":"1900"}

{"sheet":"Ark4","index":0,"n_rows":176,"n_cols":8,"rows_kept":176,"cut":false,"hidden":true,"merged":[]}
[]
[]
[null,null,null,null,null,"Værdier"]
["Lokalforening","Afleveret","Kontotypenr.","Kontotype","Aktivitetsnr. ","Sum af Indtægt","Sum af Udgift","Sum af Beløb"]
["Hovedtotal"]
[]
[]
[]
[]
[]
[]
[]
[]
[]
[]
[]
[]
[]
[]
[]
[]
[]
[]
[]
[]
[]
[]
[]
[]
[]
[]
[]
[]
[]
[]
[]
[]
[]
[]
[]
[]
[]
[]
[]
[]
[]
[]
[]
[]
[]
[]
[]
[]
[]
[]
[]
[]
[]
[]
[]
[]
[]
[]
[]
[]
[]
[]
[]
[]
[]
[]
[]
[]
[]
[]
[]
[]
[]
[]
[]
{"$rows_left_out":97}
{"sheet":"Forside","index":1,"n_rows":36,"n_cols":10,"rows_kept":36,"cut":false,"hidden":false,"merged":[[7,2,7,6],[8,2,8,6],[9,2,9,6],[13,1,15,6],[1,1,1,6],[2,1,3,6],[4,2,4,6],[5,2,5,6],[6,2,6,6]]}
[null,null,null,null,null,null,null,null,"Elektronisk","Hovedstaden"]
[null,null,null,null,null,null,null,null,"Fysisk","Sjælland"]
[null,"Årsregnskab 2021",null,null,null,null,null,null,null,"Syd"]
[null,null,null,null,null,null,null,null,null,"Nord"]
[null,"Region",null,null,null,null,null,null,null,"Midt"]
[null,"Lokalforeningsnavn/Klub"]
[null,"Kassererens navn"]
[null,"Kassererens e-mail-adresse"]
[null,"Dato for indsendelse af regnskab"]
[null,"Regnskab aflægges fysisk el. elektronisk"]
[]
[]
[null,"Bemærkninger til regnskabet"]
[]
[]
[]
[]
[]
[]
[null,"Økonomisk status"]
[null,"Åbningssaldo bank 1. jan. 2021",null,{"$f":"'Overblik årsregnskab'!I5","v":0}]
[null,"Beholdning bank pr. dags dato ",null,{"$f":"'Overblik årsregnskab'!I6","v":0}]
[null,"Kontant beholdning",null,{"$f":"'Overblik årsregnskab'!I7","v":0}]
[null,"Resultat",null,{"$f":"D22+D23","v":0}]
[]
[]
[]
[]
[]
[]
[null,"Regnskabets rigtighed bekræftes: ",null,"Dato:"]
[null,"Formand"]
[]
[null,"Kasserer"]
[]
[null,"Resten af bestyrelsen"]

{"sheet":"Budget 2021","index":2,"n_rows":40,"n_cols":3,"rows_kept":40,"cut":false,"hidden":false,"merged":[]}
["Aktivitetsnr.","Aktiviteter","Budgetteret "]
[1,"Nytårsmarch",0]
[2,"Hjertecafé",0]
[3,"Foredrag",0]
[4,"Hjertemotion",0]
[5,"Hverveaktiviteter",0]
[6,"Digitale/online aktiviteter",0]
[7,"Andre udendørsaktiviteter",0]
[8,"Hjertesti",0]
[9,"Hjerteredderkursus (GIV LIV)",0]
[10,"Andre typer livreddende kurser",0]
[11,"Generalforsamling",0]
[12,"Bestyrelsesmøder",0]
[13,"Sommerarrangement",0]
[14,"Julearrangement",0]
[15,"Landsuddeling 2021",0]
[16,"Samarbejde med andre",0]
[17,"Netværksarrangementer",0]
[18,"Kostaktiviteter eller undervisning",0]
[19,"Børnebørnenes madværksted",0]
[20,"Kontingenter Frivilligcenter, andre",0]
[21,"Udgifter til bankkonto, gebyrer",0]
[22,"Øvrigt kontorhold",0]
[23,"Gaver",0]
[24,"Frivilliggodtgørelse (telefon og internet)",0]
[25,"§18-midler og tilskud",0]
[26,"Øvrige",0]
[27,"Forudbetalinger (periodisering)",0]
[28,"Manglende omkostninger (ikke afholdt)",0]
[60,"(Skriv og erstat)"]
[61,"(Skriv og erstat)"]
[62,"(Skriv og erstat)"]
[63,"(Skriv og erstat)"]
[64,"(Skriv og erstat)"]
[65,"(Skriv og erstat)"]
[66,"(Skriv og erstat)"]
[67,"(Skriv og erstat)"]
[68,"(Skriv og erstat)"]
[69,"(Skriv og erstat)"]
[70,"(Skriv og erstat)"]

{"sheet":"Bogføring 2021","index":3,"n_rows":501,"n_cols":23,"rows_kept":501,"cut":false,"hidden":false,"merged":[]}
["Region","Lokalforening","Kassererens Navn","Kassererens e-mail-adresse","Regnskab sendt dato","Afleveret","Bilagsnr.","Dato","Præcis bilagstekst","Beløb","Saldo","Kontotypenr.","Kontotype","Aktivitetsnr. ","Aktivitet","Indtægt","Udgift",null,null,"Kontotypenr.","Kontotype","Aktivitetsnr.","Aktiviteter"]
[null,null,null,null,null,null,null,null,null,null,null,null,null,null,null,null,null,null,null,100,"Annoncer",1,{"$f":"IF('Budget 2021'!B2<>\"(Skriv og erstat)\",VLOOKUP('Bogføring 2021'!V2,'Budget 2021'!A2:B40,2,FALSE),\"\")","v":"Nytårsmarch"}]
[{"$f":"Forside!C5","v":0},{"$f":"Forside!C6","v":0},{"$f":"Forside!C7","v":0},{"$f":"Forside!C8","v":0},{"$f":"Forside!C9","v":"00:00:00"},{"$f":"Forside!C10","v":0},null,null,null,null,{"$f":"IF(_xlfn.NUMBERVALUE(J3),K2+J3,\"\")","v":""},null,{"$f":"IF(ISNA(VLOOKUP(L3,$T$1:$U$40,2,FALSE)),\"\",VLOOKUP(L3,$T$1:$U$40,2,FALSE))","v":""},null,{"$f":"IF(ISNA(VLOOKUP(N3,$V$1:$W$40,2,FALSE)),\"\",VLOOKUP(N3,$V$1:$W$40,2,FALSE))","v":""},{"$f":"IF(J3>0,J3,0)","v":0},{"$f":"IF(J3<0,J3,0)","v":0},null,null,110,"Transport og kørsel",2,{"$f":"IF('Budget 2021'!B3<>\"(Skriv og erstat)\",VLOOKUP('Bogføring 2021'!V3,'Budget 2021'!A3:B41,2,FALSE),\"\")","v":"Hjertecafé"}]
[{"$f":"A3","v":0},0,0,0,"00:00:00",0,null,null,null,null,{"$f":"IF(_xlfn.NUMBERVALUE(J4),K3+J4,\"\")","v":""},null,{"$f":"IF(ISNA(VLOOKUP(L4,$T$1:$U$40,2,FALSE)),\"\",VLOOKUP(L4,$T$1:$U$40,2,FALSE))","v":""},null,{"$f":"IF(ISNA(VLOOKUP(N4,$V$1:$W$40,2,FALSE)),\"\",VLOOKUP(N4,$V$1:$W$40,2,FALSE))","v":""},{"$f":"IF(J4>0,J4,0)","v":0},{"$f":"IF(J4<0,J4,0)","v":0},null,null,120,"Tryksager",3,{"$f":"IF('Budget 2021'!B4<>\"(Skriv og erstat)\",VLOOKUP('Bogføring 2021'!V4,'Budget 2021'!A4:B42,2,FALSE),\"\")","v":"Foredrag"}]
[null,null,null,null,null,null,null,null,null,null,"",null,"",null,"",0,0,null,null,130,"Forplejning",4,{"$f":"IF('Budget 2021'!B5<>\"(Skriv og erstat)\",VLOOKUP('Bogføring 2021'!V5,'Budget 2021'!A5:B43,2,FALSE),\"\")","v":"Hjertemotion"}]
[null,null,null,null,null,null,null,null,null,null,"",null,"",null,"",0,0,null,null,140,"Kontorhold",5,{"$f":"IF('Budget 2021'!B6<>\"(Skriv og erstat)\",VLOOKUP('Bogføring 2021'!V6,'Budget 2021'!A6:B44,2,FALSE),\"\")","v":"Hverveaktiviteter"}]
[null,null,null,null,null,null,null,null,null,null,"",null,"",null,"",0,0,null,null,150,"Gaver",6,{"$f":"IF('Budget 2021'!B7<>\"(Skriv og erstat)\",VLOOKUP('Bogføring 2021'!V7,'Budget 2021'!A7:B45,2,FALSE),\"\")","v":"Digitale/online aktiviteter"}]
[null,null,null,null,null,null,null,null,null,null,"",null,"",null,"",0,0,null,null,160,"Løn og honorar",7,{"$f":"IF('Budget 2021'!B8<>\"(Skriv og erstat)\",VLOOKUP('Bogføring 2021'!V8,'Budget 2021'!A8:B46,2,FALSE),\"\")","v":"Andre udendørsaktiviteter"}]
[null,null,null,null,null,null,null,null,null,null,"",null,"",null,"",0,0,null,null,170,"Lokaleleje",8,{"$f":"IF('Budget 2021'!B9<>\"(Skriv og erstat)\",VLOOKUP('Bogføring 2021'!V9,'Budget 2021'!A9:B47,2,FALSE),\"\")","v":"Hjertesti"}]
[null,null,null,null,null,null,null,null,null,null,"",null,"",null,"",0,0,null,null,180,"Materialer",9,{"$f":"IF('Budget 2021'!B10<>\"(Skriv og erstat)\",VLOOKUP('Bogføring 2021'!V10,'Budget 2021'!A10:B48,2,FALSE),\"\")","v":"Hjerteredderkursus (GIV LIV)"}]
[null,null,null,null,null,null,null,null,null,null,"",null,"",null,"",0,0,null,null,190,"Licens og software",10,{"$f":"IF('Budget 2021'!B11<>\"(Skriv og erstat)\",VLOOKUP('Bogføring 2021'!V11,'Budget 2021'!A11:B49,2,FALSE),\"\")","v":"Andre typer livreddende kurser"}]
[null,null,null,null,null,null,null,null,null,null,"",null,"",null,"",0,0,null,null,200,"Varekøb til videresalg ",11,{"$f":"IF('Budget 2021'!B12<>\"(Skriv og erstat)\",VLOOKUP('Bogføring 2021'!V12,'Budget 2021'!A12:B50,2,FALSE),\"\")","v":"Generalforsamling"}]
[null,null,null,null,null,null,null,null,null,null,"",null,"",null,"",0,0,null,null,210,"Værnemidler",12,{"$f":"IF('Budget 2021'!B13<>\"(Skriv og erstat)\",VLOOKUP('Bogføring 2021'!V13,'Budget 2021'!A13:B51,2,FALSE),\"\")","v":"Bestyrelsesmøder"}]
[null,null,null,null,null,null,null,null,null,null,"",null,"",null,"",0,0,null,null,220,"Udgifter til bank",13,{"$f":"IF('Budget 2021'!B14<>\"(Skriv og erstat)\",VLOOKUP('Bogføring 2021'!V14,'Budget 2021'!A14:B52,2,FALSE),\"\")","v":"Sommerarrangement"}]
[null,null,null,null,null,null,null,null,null,null,"",null,"",null,"",0,0,null,null,230,"Periodisering",14,{"$f":"IF('Budget 2021'!B15<>\"(Skriv og erstat)\",VLOOKUP('Bogføring 2021'!V15,'Budget 2021'!A15:B53,2,FALSE),\"\")","v":"Julearrangement"}]
[null,null,null,null,null,null,null,null,null,null,"",null,"",null,"",0,0,null,null,240,"Øvrige",15,{"$f":"IF('Budget 2021'!B16<>\"(Skriv og erstat)\",VLOOKUP('Bogføring 2021'!V16,'Budget 2021'!A16:B54,2,FALSE),\"\")","v":"Landsuddeling 2021"}]
[null,null,null,null,null,null,null,null,null,null,"",null,"",null,"",0,0,null,null,null,null,16,{"$f":"IF('Budget 2021'!B17<>\"(Skriv og erstat)\",VLOOKUP('Bogføring 2021'!V17,'Budget 2021'!A17:B55,2,FALSE),\"\")","v":"Samarbejde med andre"}]
[null,null,null,null,null,null,null,null,null,null,"",null,"",null,"",0,0,null,null,null,null,17,{"$f":"IF('Budget 2021'!B18<>\"(Skriv og erstat)\",VLOOKUP('Bogføring 2021'!V18,'Budget 2021'!A18:B56,2,FALSE),\"\")","v":"Netværksarrangementer"}]
[null,null,null,null,null,null,null,null,null,null,"",null,"",null,"",0,0,null,null,300,"Tilskud fra HF (indtægt)",18,{"$f":"IF('Budget 2021'!B19<>\"(Skriv og erstat)\",VLOOKUP('Bogføring 2021'!V19,'Budget 2021'!A19:B57,2,FALSE),\"\")","v":"Kostaktiviteter eller undervisning"}]
[null,null,null,null,null,null,null,null,null,null,"",null,"",null,"",0,0,null,null,310,"Sponsorater og donationer (indtægt)",19,{"$f":"IF('Budget 2021'!B20<>\"(Skriv og erstat)\",VLOOKUP('Bogføring 2021'!V20,'Budget 2021'!A20:B58,2,FALSE),\"\")","v":"Børnebørnenes madværksted"}]
[null,null,null,null,null,null,null,null,null,null,"",null,"",null,"",0,0,null,null,320,"§18/§79-midler (indtægt)",20,{"$f":"IF('Budget 2021'!B21<>\"(Skriv og erstat)\",VLOOKUP('Bogføring 2021'!V21,'Budget 2021'!A21:B59,2,FALSE),\"\")","v":"Kontingenter Frivilligcenter, andre"}]
[null,null,null,null,null,null,null,null,null,null,"",null,"",null,"",0,0,null,null,330,"Deltagerbetaling (indtægt)",21,{"$f":"IF('Budget 2021'!B22<>\"(Skriv og erstat)\",VLOOKUP('Bogføring 2021'!V22,'Budget 2021'!A22:B60,2,FALSE),\"\")","v":"Udgifter til bankkonto, gebyrer"}]
[null,null,null,null,null,null,null,null,null,null,"",null,"",null,"",0,0,null,null,null,null,22,{"$f":"IF('Budget 2021'!B23<>\"(Skriv og erstat)\",VLOOKUP('Bogføring 2021'!V23,'Budget 2021'!A23:B61,2,FALSE),\"\")","v":"Øvrigt kontorhold"}]
[null,null,null,null,null,null,null,null,null,null,"",null,"",null,"",0,0,null,null,null,null,23,{"$f":"IF('Budget 2021'!B24<>\"(Skriv og erstat)\",VLOOKUP('Bogføring 2021'!V24,'Budget 2021'!A24:B62,2,FALSE),\"\")","v":"Gaver"}]
[null,null,null,null,null,null,null,null,null,null,"",null,"",null,"",0,0,null,null,null,null,24,{"$f":"IF('Budget 2021'!B25<>\"(Skriv og erstat)\",VLOOKUP('Bogføring 2021'!V25,'Budget 2021'!A25:B63,2,FALSE),\"\")","v":"Frivilliggodtgørelse (telefon og internet)"}]
[null,null,null,null,null,null,null,null,null,null,"",null,"",null,"",0,0,null,null,null,null,25,{"$f":"IF('Budget 2021'!B26<>\"(Skriv og erstat)\",VLOOKUP('Bogføring 2021'!V26,'Budget 2021'!A26:B64,2,FALSE),\"\")","v":"§18-midler og tilskud"}]
[null,null,null,null,null,null,null,null,null,null,"",null,"",null,"",0,0,null,null,null,null,26,{"$f":"IF('Budget 2021'!B27<>\"(Skriv og erstat)\",VLOOKUP('Bogføring 2021'!V27,'Budget 2021'!A27:B65,2,FALSE),\"\")","v":"Øvrige"}]
[null,null,null,null,null,null,null,null,null,null,"",null,"",null,"",0,0,null,null,null,null,27,{"$f":"IF('Budget 2021'!B28<>\"(Skriv og erstat)\",VLOOKUP('Bogføring 2021'!V28,'Budget 2021'!A28:B66,2,FALSE),\"\")","v":"Forudbetalinger (periodisering)"}]
[null,null,null,null,null,null,null,null,null,null,"",null,"",null,"",0,0,null,null,null,null,28,{"$f":"IF('Budget 2021'!B29<>\"(Skriv og erstat)\",VLOOKUP('Bogføring 2021'!V29,'Budget 2021'!A29:B67,2,FALSE),\"\")","v":"Manglende omkostninger (ikke afholdt)"}]
[null,null,null,null,null,null,null,null,null,null,"",null,"",null,"",0,0,null,null,null,null,60,{"$f":"IF('Budget 2021'!B30<>\"(Skriv og erstat)\",VLOOKUP('Bogføring 2021'!V30,'Budget 2021'!$A$30:$B$68,2,FALSE),\"\")","v":""}]
[null,null,null,null,null,null,null,null,null,null,"",null,"",null,"",0,0,null,null,null,null,61,{"$f":"IF('Budget 2021'!B31<>\"(Skriv og erstat)\",VLOOKUP('Bogføring 2021'!V31,'Budget 2021'!$A$30:$B$68,2,FALSE),\"\")","v":""}]
[null,null,null,null,null,null,null,null,null,null,"",null,"",null,"",0,0,null,null,null,null,62,{"$f":"IF('Budget 2021'!B32<>\"(Skriv og erstat)\",VLOOKUP('Bogføring 2021'!V32,'Budget 2021'!$A$30:$B$68,2,FALSE),\"\")","v":""}]
[null,null,null,null,null,null,null,null,null,null,"",null,"",null,"",0,0,null,null,null,null,63,{"$f":"IF('Budget 2021'!B33<>\"(Skriv og erstat)\",VLOOKUP('Bogføring 2021'!V33,'Budget 2021'!$A$30:$B$68,2,FALSE),\"\")","v":""}]
[null,null,null,null,null,null,null,null,null,null,"",null,"",null,"",0,0,null,null,null,null,64,{"$f":"IF('Budget 2021'!B34<>\"(Skriv og erstat)\",VLOOKUP('Bogføring 2021'!V34,'Budget 2021'!$A$30:$B$68,2,FALSE),\"\")","v":""}]
[null,null,null,null,null,null,null,null,null,null,"",null,"",null,"",0,0,null,null,null,null,65,{"$f":"IF('Budget 2021'!B35<>\"(Skriv og erstat)\",VLOOKUP('Bogføring 2021'!V35,'Budget 2021'!$A$30:$B$68,2,FALSE),\"\")","v":""}]
[null,null,null,null,null,null,null,null,null,null,"",null,"",null,"",0,0,null,null,null,null,66,{"$f":"IF('Budget 2021'!B36<>\"(Skriv og erstat)\",VLOOKUP('Bogføring 2021'!V36,'Budget 2021'!$A$30:$B$68,2,FALSE),\"\")","v":""}]
[null,null,null,null,null,null,null,null,null,null,"",null,"",null,"",0,0,null,null,null,null,67,{"$f":"IF('Budget 2021'!B37<>\"(Skriv og erstat)\",VLOOKUP('Bogføring 2021'!V37,'Budget 2021'!$A$30:$B$68,2,FALSE),\"\")","v":""}]
[null,null,null,null,null,null,null,null,null,null,"",null,"",null,"",0,0,null,null,null,null,68,{"$f":"IF('Budget 2021'!B38<>\"(Skriv og erstat)\",VLOOKUP('Bogføring 2021'!V38,'Budget 2021'!$A$30:$B$68,2,FALSE),\"\")","v":""}]
[null,null,null,null,null,null,null,null,null,null,"",null,"",null,"",0,0,null,null,null,null,69,{"$f":"IF('Budget 2021'!B39<>\"(Skriv og erstat)\",VLOOKUP('Bogføring 2021'!V39,'Budget 2021'!$A$30:$B$68,2,FALSE),\"\")","v":""}]
[null,null,null,null,null,null,null,null,null,null,"",null,"",null,"",0,0,null,null,null,null,70,{"$f":"IF('Budget 2021'!B40<>\"(Skriv og erstat)\",VLOOKUP('Bogføring 2021'!V40,'Budget 2021'!$A$30:$B$68,2,FALSE),\"\")","v":""}]
[null,null,null,null,null,null,null,null,null,null,"",null,"",null,"",0,0]
[null,null,null,null,null,null,null,null,null,null,"",null,"",null,"",0,0]
[null,null,null,null,null,null,null,null,null,null,"",null,"",null,"",0,0]
[null,null,null,null,null,null,null,null,null,null,"",null,"",null,"",0,0]
[null,null,null,null,null,null,null,null,null,null,"",null,"",null,"",0,0]
[null,null,null,null,null,null,null,null,null,null,"",null,"",null,"",0,0]
[null,null,null,null,null,null,null,null,null,null,"",null,"",null,"",0,0]
[null,null,null,null,null,null,null,null,null,null,"",null,"",null,"",0,0]
[null,null,null,null,null,null,null,null,null,null,"",null,"",null,"",0,0]
[null,null,null,null,null,null,null,null,null,null,"",null,"",null,"",0,0]
[null,null,null,null,null,null,null,null,null,null,"",null,"",null,"",0,0]
[null,null,null,null,null,null,null,null,null,null,"",null,"",null,"",0,0]
[null,null,null,null,null,null,null,null,null,null,"",null,"",null,"",0,0]
[null,null,null,null,null,null,null,null,null,null,"",null,"",null,"",0,0]
[null,null,null,null,null,null,null,null,null,null,"",null,"",null,"",0,0]
[null,null,null,null,null,null,null,null,null,null,"",null,"",null,"",0,0]
[null,null,null,null,null,null,null,null,null,null,"",null,"",null,"",0,0]
[null,null,null,null,null,null,null,null,null,null,"",null,"",null,"",0,0]
[null,null,null,null,null,null,null,null,null,null,"",null,"",null,"",0,0]
[null,null,null,null,null,null,null,null,null,null,"",null,"",null,"",0,0]
[null,null,null,null,null,null,null,null,null,null,"",null,"",null,"",0,0]
[null,null,null,null,null,null,null,null,null,null,"",null,"",null,"",0,0]
[null,null,null,null,null,null,null,null,null,null,"",null,"",null,"",0,0]
[null,null,null,null,null,null,null,null,null,null,"",null,"",null,"",0,0]
[null,null,null,null,null,null,null,null,null,null,"",null,"",null,"",0,0]
[null,null,null,null,null,null,null,null,null,null,"",null,"",null,"",0,0]
[null,null,null,null,null,null,null,null,null,null,"",null,"",null,"",0,0]
[null,null,null,null,null,null,null,null,null,null,{"$f":"IF(_xlfn.NUMBERVALUE(J68),K67+J68,\"\")","v":""},null,{"$f":"IF(ISNA(VLOOKUP(L68,$T$1:$U$40,2,FALSE)),\"\",VLOOKUP(L68,$T$1:$U$40,2,FALSE))","v":""},null,{"$f":"IF(ISNA(VLOOKUP(N68,$V$1:$W$40,2,FALSE)),\"\",VLOOKUP(N68,$V$1:$W$40,2,FALSE))","v":""},{"$f":"IF(J68>0,J68,0)","v":0},{"$f":"IF(J68<0,J68,0)","v":0}]
[null,null,null,null,null,null,null,null,null,null,"",null,"",null,"",0,0]
[null,null,null,null,null,null,null,null,null,null,"",null,"",null,"",0,0]
[null,null,null,null,null,null,null,null,null,null,"",null,"",null,"",0,0]
[null,null,null,null,null,null,null,null,null,null,"",null,"",null,"",0,0]
[null,null,null,null,null,null,null,null,null,null,"",null,"",null,"",0,0]
[null,null,null,null,null,null,null,null,null,null,"",null,"",null,"",0,0]
[null,null,null,null,null,null,null,null,null,null,"",null,"",null,"",0,0]
[null,null,null,null,null,null,null,null,null,null,"",null,"",null,"",0,0]
[null,null,null,null,null,null,null,null,null,null,"",null,"",null,"",0,0]
[null,null,null,null,null,null,null,null,null,null,"",null,"",null,"",0,0]
[null,null,null,null,null,null,null,null,null,null,"",null,"",null,"",0,0]
[null,null,null,null,null,null,null,null,null,null,"",null,"",null,"",0,0]
{"$rows_left_out":422}
{"sheet":"Overblik årsregnskab","index":4,"n_rows":49,"n_cols":9,"rows_kept":49,"cut":false,"hidden":false,"merged":[[45,0,45,4],[1,6,1,8],[1,0,1,4]]}
[]
["Årsregnskab - aktiviteter",null,null,null,null,null,"Økonomisk overblik"]
[null,null,"Værdier"]
["Aktivitetsnr.","Aktiviteter","Indtægter","Udgifter"," Budgetteret",null,"Økonomisk status"]
[1,"Nytårsmarch",null,null,0,null,"Åbningssaldo bank 1. jan. 2021",null,{"$f":"IF(_xlfn.NUMBERVALUE('Bogføring 2021'!K2),'Bogføring 2021'!K2,0)","v":0}]
[2,"Hjertecafé",null,null,0,null,"Beholdning bank pr. dags dato ",null,{"$f":"'Bogføring 2021'!J501","v":0}]
[3,"Foredrag",null,null,0,null,"Kontant beholdning (skriv selv beløb)"]
[4,"Hjertemotion",null,null,0,null,"Resultat",null,{"$f":"IF(_xlfn.NUMBERVALUE(I5),I6+I7,\"\")","v":""}]
[5,"Hverveaktiviteter",null,null,0]
[6,"Digitale/online aktiviteter",null,null,0]
[7,"Andre udendørsaktiviteter",null,null,0,null,"Status for indtægter og udgifter"]
[8,"Hjertesti",null,null,0,null,"Indtægter til dags dato",null,{"$f":"GETPIVOTDATA(\"[Measures].[Summen af Indtægt]\",$A$3)","v":0}]
[9,"Hjerteredderkursus (GIV LIV)",null,null,0,null,"Udgifter til dags dato",null,{"$f":"GETPIVOTDATA(\"[Measures].[Summen af Udgift]\",$A$3)","v":0}]
[10,"Andre typer livreddende kurser",null,null,0,null,"Resultat",null,{"$f":"I12+I13","v":0}]
[11,"Generalforsamling",null,null,0]
[12,"Bestyrelsesmøder",null,null,0]
[13,"Sommerarrangement",null,null,0,null,"Heraf periodiseret "]
[14,"Julearrangement",null,null,0,null,"Forudbetalinger (periodisering)",null,{"$f":"SUMIF('Bogføring 2021'!O3:O500,'Bogføring 2021'!W28,'Bogføring 2021'!P3:P500)+SUMIF('Bogføring 2021'!O3:O500,'Bogføring 2021'!W28,'Bogføring 2021'!Q3:Q500)","v":0}]
[15,"Landsuddeling 2021",null,null,0,null,"Manglende omkostninger (ikke afholdt)",null,{"$f":"SUMIF('Bogføring 2021'!O3:O500,'Bogføring 2021'!W29,'Bogføring 2021'!P3:P500)+SUMIF('Bogføring 2021'!O3:O500,'Bogføring 2021'!W29,'Bogføring 2021'!Q3:Q500)","v":0}]
[16,"Samarbejde med andre",null,null,0,null,"Resultat uden periodisering",null,{"$f":"I12+I13-I18-I19","v":0}]
[17,"Netværksarrangementer",null,null,0]
[18,"Kostaktiviteter eller undervisning",null,null,0]
[19,"Børnebørnenes madværksted",null,null,0]
[20,"Kontingenter Frivilligcenter, andre",null,null,0]
[21,"Udgifter til bankkonto, gebyrer",null,null,0]
[22,"Øvrigt kontorhold",null,null,0]
[23,"Gaver",null,null,0]
[24,"Frivilliggodtgørelse (telefon og internet)",null,null,0]
[25,"§18-midler og tilskud",null,null,0]
[26,"Øvrige",null,null,0]
[27,"Forudbetalinger (periodisering)",null,null,0]
[28,"Manglende omkostninger (ikke afholdt)",null,null,0]
["Hovedtotal",null,null,null,0]
[]
[]
[]
[]
[]
[]
[]
[]
[]
[]
[]
[]
["Årsregnskab - kontotyper"]
[null,null,"Værdier"]
["Kontotypenr.","Kontotype"," Indtægter"," Udgifter","Forskel"]
["Hovedtotal"]

{"sheet":"Kontoplan til print","index":5,"n_rows":40,"n_cols":4,"rows_kept":40,"cut":false,"hidden":false,"merged":[]}
["Kontotypenr.","Kontotype","Aktivitetsnr.","Aktiviteter"]
[100,"Annoncer",1,"Nytårsmarch"]
[110,"Transport og kørsel",2,"Hjertecafé"]
[120,"Tryksager",3,"Foredrag"]
[130,"Forplejning",4,"Hjertemotion"]
[140,"Kontorhold",5,"Hverveaktiviteter"]
[150,"Gaver",6,"Digitale/online aktiviteter"]
[160,"Løn og honorar",7,"Andre udendørsaktiviteter"]
[170,"Lokaleleje",8,"Hjertesti"]
[180,"Materialer",9,"Hjerteredderkursus (GIV LIV)"]
[190,"Licens og software",10,"Andre typer livreddende kurser"]
[200,"Varekøb til videresalg ",11,"Generalforsamling"]
[210,"Værnemidler",12,"Bestyrelsesmøder"]
[220,"Udgifter til bank",13,"Sommerarrangement"]
[230,"Periodisering",14,"Julearrangement"]
[240,"Øvrige",15,"Landsuddeling 2021"]
[null,null,16,"Samarbejde med andre/patientfor."]
[null,null,17,"Netværksarrangementer"]
[300,"Tilskud fra HF (indtægt)",18,"Kostaktiviteter eller undervisning"]
[310,"Sponsorater og donationer (indtægt)",19,"Børnebørnenes madværksted"]
[320,"§18/§79-midler (indtægt)",20,"Kontingenter Frivilligcenter, andre"]
[330,"Deltagerbetaling (indtægt)",21,"Udgifter til bankkonto, gebyrer"]
[null,null,22,"Øvrige kontorhold"]
[null,null,23,"Gaver"]
[null,null,24,"Frivilliggodtgørelse (telefon og internet)"]
[null,null,25,"Paragraf 18-midler og tilskud"]
[null,null,26,"Øvrige"]
[null,null,27,"Forudbetalinger (periodisering)"]
[null,null,28,"Manglende omkostninger (ikke afholdt)"]
[null,null,60,{"$f":"IF('Budget 2021'!B30<>\"(Skriv og erstat)\",VLOOKUP('Kontoplan til print'!C30,'Budget 2021'!$A$2:$B$40,2,FALSE),\"\")","v":""}]
[null,null,61,{"$f":"IF('Budget 2021'!B31<>\"(Skriv og erstat)\",VLOOKUP('Kontoplan til print'!C31,'Budget 2021'!$A$2:$B$40,2,FALSE),\"\")","v":""}]
[null,null,62,{"$f":"IF('Budget 2021'!B32<>\"(Skriv og erstat)\",VLOOKUP('Kontoplan til print'!C32,'Budget 2021'!$A$2:$B$40,2,FALSE),\"\")","v":""}]
[null,null,63,{"$f":"IF('Budget 2021'!B33<>\"(Skriv og erstat)\",VLOOKUP('Kontoplan til print'!C33,'Budget 2021'!$A$2:$B$40,2,FALSE),\"\")","v":""}]
[null,null,64,{"$f":"IF('Budget 2021'!B34<>\"(Skriv og erstat)\",VLOOKUP('Kontoplan til print'!C34,'Budget 2021'!$A$2:$B$40,2,FALSE),\"\")","v":""}]
[null,null,65,{"$f":"IF('Budget 2021'!B35<>\"(Skriv og erstat)\",VLOOKUP('Kontoplan til print'!C35,'Budget 2021'!$A$2:$B$40,2,FALSE),\"\")","v":""}]
[null,null,66,{"$f":"IF('Budget 2021'!B36<>\"(Skriv og erstat)\",VLOOKUP('Kontoplan til print'!C36,'Budget 2021'!$A$2:$B$40,2,FALSE),\"\")","v":""}]
[null,null,67,{"$f":"IF('Budget 2021'!B37<>\"(Skriv og erstat)\",VLOOKUP('Kontoplan til print'!C37,'Budget 2021'!$A$2:$B$40,2,FALSE),\"\")","v":""}]
[null,null,68,{"$f":"IF('Budget 2021'!B38<>\"(Skriv og erstat)\",VLOOKUP('Kontoplan til print'!C38,'Budget 2021'!$A$2:$B$40,2,FALSE),\"\")","v":""}]
[null,null,69,{"$f":"IF('Budget 2021'!B39<>\"(Skriv og erstat)\",VLOOKUP('Kontoplan til print'!C39,'Budget 2021'!$A$2:$B$40,2,FALSE),\"\")","v":""}]
[null,null,70,{"$f":"IF('Budget 2021'!B40<>\"(Skriv og erstat)\",VLOOKUP('Kontoplan til print'!C40,'Budget 2021'!$A$2:$B$40,2,FALSE),\"\")","v":""}]

{"sheet":"Aktiviteter","index":6,"n_rows":40,"n_cols":2,"rows_kept":40,"cut":false,"hidden":true,"merged":[]}
[{"$f":"'Bogføring 2021'!V1:W40","v":"Aktivitetsnr."},"Aktiviteter"]
[1,"Nytårsmarch"]
[2,"Hjertecafé"]
[3,"Foredrag"]
[4,"Hjertemotion"]
[5,"Hverveaktiviteter"]
[6,"Digitale/online aktiviteter"]
[7,"Andre udendørsaktiviteter"]
[8,"Hjertesti"]
[9,"Hjerteredderkursus (GIV LIV)"]
[10,"Andre typer livreddende kurser"]
[11,"Generalforsamling"]
[12,"Bestyrelsesmøder"]
[13,"Sommerarrangement"]
[14,"Julearrangement"]
[15,"Landsuddeling 2021"]
[16,"Samarbejde med andre"]
[17,"Netværksarrangementer"]
[18,"Kostaktiviteter eller undervisning"]
[19,"Børnebørnenes madværksted"]
[20,"Kontingenter Frivilligcenter, andre"]
[21,"Udgifter til bankkonto, gebyrer"]
[22,"Øvrigt kontorhold"]
[23,"Gaver"]
[24,"Frivilliggodtgørelse (telefon og internet)"]
[25,"§18-midler og tilskud"]
[26,"Øvrige"]
[27,"Forudbetalinger (periodisering)"]
[28,"Manglende omkostninger (ikke afholdt)"]
[60,""]
[61,""]
[62,""]
[63,""]
[64,""]
[65,""]
[66,""]
[67,""]
[68,""]
[69,""]
[70,""]