{"text_format":"1","workbook":"xlsx","n_sheets":9,"sheets":["Ark4","Vejledning til ark","Forside","Budget 2022","Bogføring 2022","Overblik årsregnskab","Overblik til print","Kontoplan til print","Aktiviteter"],"not_rendered":{"charts":0,"images":2,"macros":1,"external_links":0,"defined_names":3,"comments":2,"pivot_tables":6},"unopened":[],"bounds":{"document_bytes":16777216,"sheet_cells":100000,"rows_first":2000,"rows_last":500,"rows_between":2000,"halvings":0,"cell_chars":16384,"cell_head_chars":4096},"cells_cut":0,"cells_raw":0,"read":"whole","date_system":"1900"}

{"sheet":"Ark4","index":0,"n_rows":176,"n_cols":7,"rows_kept":176,"cut":false,"hidden":true,"merged":[]}
[]
[]
[null,null,null,null,"Værdier"]
["Lokalforening","Afleveret","Kontotypenr.","Kontotype","Sum af Indtægt","Sum af Udgift","Sum af Beløb"]
["Hovedtotal"]
[]
[]
[]
[]
[]
[]
[]
[]
[]
[]
[]
[]
[]
[]
[]
[]
[]
[]
[]
[]
[]
[]
[]
[]
[]
[]
[]
[]
[]
[]
[]
[]
[]
[]
[]
{"$rows_left_out":137}
{"sheet":"Vejledning til ark","index":1,"n_rows":22,"n_cols":1,"rows_kept":22,"cut":false,"hidden":false,"merged":[]}
[]
[]
["Vejledning til regnskabsarket"]
["Kære kasserer"]
[]
["Dette er en kort vejledning til, hvordan regnskabsarket skal forstås og udfyldes. "]
["Arket er, i håbet om at være blevet mere intuitivt, bygget op omkring farvekoder. "]
[]
["Felter med farven grøn, skal I udfylde. "]
["Felter med farven gul, kan I udfylde, hvis det er relevant for jer."]
["Felter med farven rød, skal I ikke udfylde."]
[]
["Hvis der herudover skulle være nogen tvivl, henvises der til vores vejledende vidoer fra frivillignet. "]
["Disse er optaget til 2021 regnskabet, men er stadig relevante til 2022 regnskabet. "]
[]
["Se videoerne her:"]
["1.Præsentation"]
["2. Forside"]
["3. Budget og tilføjelse af aktiviteter"]
["4. Kontoplan"]
["5. Eksempel på bogføring"]
["6. Periodisering"]

{"sheet":"Forside","index":2,"n_rows":36,"n_cols":10,"rows_kept":36,"cut":false,"hidden":false,"merged":[[7,2,7,6],[8,2,8,6],[9,2,9,6],[13,1,15,6],[1,1,1,6],[2,1,3,6],[4,2,4,6],[5,2,5,6],[6,2,6,6]]}
[null,null,null,null,null,null,null,null,"Elektronisk","Hovedstaden"]
[null,null,null,null,null,null,null,null,"Fysisk","Sjælland"]
[null,"Årsregnskab 2022",null,null,null,null,null,null,null,"Syd"]
[null,null,null,null,null,null,null,null,null,"Nord"]
[null,"Region",null,null,null,null,null,null,null,"Midt"]
[null,"Lokalforeningsnavn/Klub"]
[null,"Kassererens navn"]
[null,"Kassererens e-mail-adresse"]
[null,"Dato for indsendelse af regnskab"]
[null,"Regnskab aflægges fysisk el. elektronisk"]
[]
[]
[null,"Bemærkninger til regnskabet"]
[]
[]
[]
[]
[]
[]
[null,"Økonomisk status"]
[null,"Åbningssaldo bank 1. jan. 2022",null,{"$f":"'Overblik årsregnskab'!I5","v":0}]
[null,"Beholdning bank pr. dags dato ",null,{"$f":"'Overblik årsregnskab'!I6","v":0}]
[null,"Kontant beholdning",null,{"$f":"'Overblik årsregnskab'!I7","v":0}]
[null,"Resultat",null,{"$f":"D22+D23","v":0}]
[]
[]
[]
[]
[]
[]
[null,"Regnskabets rigtighed bekræftes: ",null,"Dato:"]
[null,"Formand"]
[]
[null,"Kasserer"]
[]
[null,"Resten af bestyrelsen"]

{"sheet":"Budget 2022","index":3,"n_rows":40,"n_cols":3,"rows_kept":40,"cut":false,"hidden":false,"merged":[]}
["Aktivitetsnr.","Aktiviteter","Budgetteret "]
[1,"Nytårsmarch",0]
[2,"Hjertecafé",0]
[3,"Foredrag",0]
[4,"Hjertemotion",0]
[5,"Hverveaktiviteter",0]
[6,"Digitale/online aktiviteter",0]
[7,"Andre udendørsaktiviteter",0]
[8,"Hjertesti",0]
[9,"Hjerteredderkursus (GIV LIV)",0]
[10,"Landsuddeling 2022",0]
[11,"Generalforsamling",0]
[12,"Bestyrelsesmøder",0]
[13,"Sommerarrangement",0]
[14,"Julearrangement",0]
[15,"Samarbejde med andre",0]
[16,"Netværksarrangementer",0]
[17,"Kontingenter",0]
[18,"Udgifter til bankkonto, gebyrer",0]
[19,"Kontorhold",0]
[20,"Gaver",0]
[21,"Frivilliggodtgørelse (telefon og internet)",0]
[22,"Øvrige",0]
[23,"§18-midler og tilskud",0]
[24,"Forudbetalinger (periodisering)",0]
[25,"Manglende omkostninger (ikke afholdt)",0]
[60,"Andre aktiviteter lokalt (skriv og erstat)"]
[61,"Andre aktiviteter lokalt (skriv og erstat)"]
[62,"Andre aktiviteter lokalt (skriv og erstat)"]
[63,"Andre aktiviteter lokalt (skriv og erstat)"]
[64,"Andre aktiviteter lokalt (skriv og erstat)"]
[65,"Andre aktiviteter lokalt (skriv og erstat)"]
[66,"Andre aktiviteter lokalt (skriv og erstat)"]
[67,"Andre aktiviteter lokalt (skriv og erstat)"]
[68,"Andre aktiviteter lokalt (skriv og erstat)"]
[69,"Andre aktiviteter lokalt (skriv og erstat)"]
[70,"Andre aktiviteter lokalt (skriv og erstat)"]
[71,"Andre aktiviteter lokalt (skriv og erstat)"]
[72,"Andre aktiviteter lokalt (skriv og erstat)"]
[73,"Andre aktiviteter lokalt (skriv og erstat)"]
{"$rows_left_out":1}
{"sheet":"Bogføring 2022","index":4,"n_rows":501,"n_cols":23,"rows_kept":501,"cut":false,"hidden":false,"merged":[]}
["Region","Lokalforening","Kassererens Navn","Kassererens e-mail-adresse","Regnskab sendt dato","Afleveret","Bilagsnr.","Dato","Præcis bilagstekst","Beløb","Saldo","Kontotypenr.","Kontotype","Aktivitetsnr.","Aktivitet","Indtægt","Udgift",null,null,"Kontotypenr.","Kontotype","Aktivitetsnr.","Aktiviteter"]
[null,null,null,null,null,null,null,null,null,null,null,null,null,null,null,null,null,null,null,100,"Annoncer",1,{"$f":"IF('Budget 2022'!B2<>\"(Skriv og erstat)\",VLOOKUP('Bogføring 2022'!V2,'Budget 2022'!A2:B43,2,FALSE),\"\")","v":"Nytårsmarch"}]
[{"$f":"Forside!C5","v":0},{"$f":"Forside!C6","v":0},{"$f":"Forside!C7","v":0},{"$f":"Forside!C8","v":0},{"$f":"Forside!C9","v":"00:00:00"},{"$f":"Forside!C10","v":0},null,null,null,null,{"$f":"IF(_xlfn.NUMBERVALUE(J3),K2+J3,\"\")","v":""},null,{"$f":"IF(ISNA(VLOOKUP(L3,$T$1:$U$40,2,FALSE)),\"\",VLOOKUP(L3,$T$1:$U$40,2,FALSE))","v":""},null,{"$f":"IF(ISNA(VLOOKUP(N3,$V$1:$W$40,2,FALSE)),\"\",VLOOKUP(N3,$V$1:$W$40,2,FALSE))","v":""},{"$f":"IF(J3>0,J3,0)","v":0},{"$f":"IF(J3<0,J3,0)","v":0},null,null,110,"Transport og kørsel",2,{"$f":"IF('Budget 2022'!B3<>\"(Skriv og erstat)\",VLOOKUP('Bogføring 2022'!V3,'Budget 2022'!A3:B44,2,FALSE),\"\")","v":"Hjertecafé"}]
[{"$f":"A3","v":0},0,0,0,"00:00:00",0,null,null,null,null,"",null,{"$f":"IF(ISNA(VLOOKUP(L4,$T$1:$U$40,2,FALSE)),\"\",VLOOKUP(L4,$T$1:$U$40,2,FALSE))","v":""},null,"",{"$f":"IF(J4>0,J4,0)","v":0},{"$f":"IF(J4<0,J4,0)","v":0},null,null,120,"Tryksager",3,{"$f":"IF('Budget 2022'!B4<>\"(Skriv og erstat)\",VLOOKUP('Bogføring 2022'!V4,'Budget 2022'!A4:B45,2,FALSE),\"\")","v":"Foredrag"}]
[null,null,null,null,null,null,null,null,null,null,"",null,"",null,"",0,0,null,null,130,"Forplejning",4,{"$f":"IF('Budget 2022'!B5<>\"(Skriv og erstat)\",VLOOKUP('Bogføring 2022'!V5,'Budget 2022'!A5:B46,2,FALSE),\"\")","v":"Hjertemotion"}]
[null,null,null,null,null,null,null,null,null,null,"",null,"",null,"",0,0,null,null,140,"Kontorhold",5,{"$f":"IF('Budget 2022'!B6<>\"(Skriv og erstat)\",VLOOKUP('Bogføring 2022'!V6,'Budget 2022'!A6:B47,2,FALSE),\"\")","v":"Hverveaktiviteter"}]
[null,null,null,null,null,null,null,null,null,null,"",null,"",null,"",0,0,null,null,150,"Gaver",6,{"$f":"IF('Budget 2022'!B7<>\"(Skriv og erstat)\",VLOOKUP('Bogføring 2022'!V7,'Budget 2022'!A7:B48,2,FALSE),\"\")","v":"Digitale/online aktiviteter"}]
[null,null,null,null,null,null,null,null,null,null,"",null,"",null,"",0,0,null,null,160,"Løn og honorar",7,{"$f":"IF('Budget 2022'!B8<>\"(Skriv og erstat)\",VLOOKUP('Bogføring 2022'!V8,'Budget 2022'!A8:B49,2,FALSE),\"\")","v":"Andre udendørsaktiviteter"}]
[null,null,null,null,null,null,null,null,null,null,"",null,"",null,"",0,0,null,null,170,"Lokaleleje",8,{"$f":"IF('Budget 2022'!B9<>\"(Skriv og erstat)\",VLOOKUP('Bogføring 2022'!V9,'Budget 2022'!A9:B50,2,FALSE),\"\")","v":"Hjertesti"}]
[null,null,null,null,null,null,null,null,null,null,"",null,"",null,"",0,0,null,null,180,"Materialer",9,{"$f":"IF('Budget 2022'!B10<>\"(Skriv og erstat)\",VLOOKUP('Bogføring 2022'!V10,'Budget 2022'!A10:B51,2,FALSE),\"\")","v":"Hjerteredderkursus (GIV LIV)"}]
[null,null,null,null,null,null,null,null,null,null,"",null,"",null,"",0,0,null,null,190,"Licens og software",10,{"$f":"IF('Budget 2022'!B11<>\"(Skriv og erstat)\",VLOOKUP('Bogføring 2022'!V11,'Budget 2022'!A11:B52,2,FALSE),\"\")","v":"Landsuddeling 2022"}]
[null,null,null,null,null,null,null,null,null,null,"",null,"",null,"",0,0,null,null,200,"Varekøb til videresalg ",11,{"$f":"IF('Budget 2022'!B12<>\"(Skriv og erstat)\",VLOOKUP('Bogføring 2022'!V12,'Budget 2022'!A12:B53,2,FALSE),\"\")","v":"Generalforsamling"}]
[null,null,null,null,null,null,null,null,null,null,"",null,"",null,"",0,0,null,null,210,"Værnemidler",12,{"$f":"IF('Budget 2022'!B13<>\"(Skriv og erstat)\",VLOOKUP('Bogføring 2022'!V13,'Budget 2022'!A13:B54,2,FALSE),\"\")","v":"Bestyrelsesmøder"}]
[null,null,null,null,null,null,null,null,null,null,"",null,"",null,"",0,0,null,null,220,"Udgifter til bank",13,{"$f":"IF('Budget 2022'!B14<>\"(Skriv og erstat)\",VLOOKUP('Bogføring 2022'!V14,'Budget 2022'!A14:B55,2,FALSE),\"\")","v":"Sommerarrangement"}]
[null,null,null,null,null,null,null,null,null,null,"",null,"",null,"",0,0,null,null,230,"Periodisering",14,{"$f":"IF('Budget 2022'!B15<>\"(Skriv og erstat)\",VLOOKUP('Bogføring 2022'!V15,'Budget 2022'!A15:B56,2,FALSE),\"\")","v":"Julearrangement"}]
[null,null,null,null,null,null,null,null,null,null,"",null,"",null,"",0,0,null,null,240,"Øvrige",15,{"$f":"IF('Budget 2022'!B16<>\"(Skriv og erstat)\",VLOOKUP('Bogføring 2022'!V16,'Budget 2022'!A16:B57,2,FALSE),\"\")","v":"Samarbejde med andre"}]
[null,null,null,null,null,null,null,null,null,null,"",null,"",null,"",0,0,null,null,null,null,16,{"$f":"IF('Budget 2022'!B17<>\"(Skriv og erstat)\",VLOOKUP('Bogføring 2022'!V17,'Budget 2022'!A17:B58,2,FALSE),\"\")","v":"Netværksarrangementer"}]
[null,null,null,null,null,null,null,null,null,null,"",null,"",null,"",0,0,null,null,null,null,17,{"$f":"IF('Budget 2022'!B18<>\"(Skriv og erstat)\",VLOOKUP('Bogføring 2022'!V18,'Budget 2022'!A18:B59,2,FALSE),\"\")","v":"Kontingenter"}]
[null,null,null,null,null,null,null,null,null,null,"",null,"",null,"",0,0,null,null,300,"Tilskud fra HF (indtægt)",18,{"$f":"IF('Budget 2022'!B19<>\"(Skriv og erstat)\",VLOOKUP('Bogføring 2022'!V19,'Budget 2022'!A19:B60,2,FALSE),\"\")","v":"Udgifter til bankkonto, gebyrer"}]
[null,null,null,null,null,null,null,null,null,null,"",null,"",null,"",0,0,null,null,310,"Sponsorater og donationer (indtægt)",19,{"$f":"IF('Budget 2022'!B20<>\"(Skriv og erstat)\",VLOOKUP('Bogføring 2022'!V20,'Budget 2022'!A20:B61,2,FALSE),\"\")","v":"Kontorhold"}]
[null,null,null,null,null,null,null,null,null,null,"",null,"",null,"",0,0,null,null,320,"§18/§79-midler (indtægt)",20,{"$f":"IF('Budget 2022'!B21<>\"(Skriv og erstat)\",VLOOKUP('Bogføring 2022'!V21,'Budget 2022'!A21:B62,2,FALSE),\"\")","v":"Gaver"}]
[null,null,null,null,null,null,null,null,null,null,"",null,"",null,"",0,0,null,null,330,"Deltagerbetaling (indtægt)",21,{"$f":"IF('Budget 2022'!B22<>\"(Skriv og erstat)\",VLOOKUP('Bogføring 2022'!V22,'Budget 2022'!A22:B63,2,FALSE),\"\")","v":"Frivilliggodtgørelse (telefon og internet)"}]
[null,null,null,null,null,null,null,null,null,null,"",null,"",null,"",0,0,null,null,null,null,22,{"$f":"IF('Budget 2022'!B23<>\"(Skriv og erstat)\",VLOOKUP('Bogføring 2022'!V23,'Budget 2022'!A23:B64,2,FALSE),\"\")","v":"Øvrige"}]
[null,null,null,null,null,null,null,null,null,null,"",null,"",null,"",0,0,null,null,null,null,23,{"$f":"IF('Budget 2022'!B24<>\"(Skriv og erstat)\",VLOOKUP('Bogføring 2022'!V24,'Budget 2022'!A24:B65,2,FALSE),\"\")","v":"§18-midler og tilskud"}]
[null,null,null,null,null,null,null,null,null,null,"",null,"",null,"",0,0,null,null,null,null,24,{"$f":"IF('Budget 2022'!B25<>\"(Skriv og erstat)\",VLOOKUP('Bogføring 2022'!V25,'Budget 2022'!A25:B65,2,FALSE),\"\")","v":"Forudbetalinger (periodisering)"}]
[null,null,null,null,null,null,null,null,null,null,"",null,"",null,"",0,0,null,null,null,null,25,{"$f":"IF('Budget 2022'!B26<>\"(Skriv og erstat)\",VLOOKUP('Bogføring 2022'!V26,'Budget 2022'!A26:B66,2,FALSE),\"\")","v":"Manglende omkostninger (ikke afholdt)"}]
[null,null,null,null,null,null,null,null,null,null,"",null,"",null,"",0,0,null,null,null,null,60,{"$f":"IF('Budget 2022'!B27<>\"(Skriv og erstat)\",VLOOKUP('Bogføring 2022'!V27,'Budget 2022'!A27:B65,2,FALSE),\"\")","v":"Andre aktiviteter lokalt (skriv og erstat)"}]
[null,null,null,null,null,null,null,null,null,null,"",null,"",null,"",0,0,null,null,null,null,61,{"$f":"IF('Budget 2022'!B28<>\"(Skriv og erstat)\",VLOOKUP('Bogføring 2022'!V28,'Budget 2022'!A28:B66,2,FALSE),\"\")","v":"Andre aktiviteter lokalt (skriv og erstat)"}]
[null,null,null,null,null,null,null,null,null,null,"",null,"",null,"",0,0,null,null,null,null,62,{"$f":"IF('Budget 2022'!B29<>\"(Skriv og erstat)\",VLOOKUP('Bogføring 2022'!V29,'Budget 2022'!A29:B67,2,FALSE),\"\")","v":"Andre aktiviteter lokalt (skriv og erstat)"}]
[null,null,null,null,null,null,null,null,null,null,"",null,"",null,"",0,0,null,null,null,null,63,{"$f":"IF('Budget 2022'!B30<>\"(Skriv og erstat)\",VLOOKUP('Bogføring 2022'!V30,'Budget 2022'!A30:B68,2,FALSE),\"\")","v":"Andre aktiviteter lokalt (skriv og erstat)"}]
[null,null,null,null,null,null,null,null,null,null,"",null,"",null,"",0,0,null,null,null,null,64,{"$f":"IF('Budget 2022'!B31<>\"(Skriv og erstat)\",VLOOKUP('Bogføring 2022'!V31,'Budget 2022'!A31:B69,2,FALSE),\"\")","v":"Andre aktiviteter lokalt (skriv og erstat)"}]
[null,null,null,null,null,null,null,null,null,null,"",null,"",null,"",0,0,null,null,null,null,65,{"$f":"IF('Budget 2022'!B32<>\"(Skriv og erstat)\",VLOOKUP('Bogføring 2022'!V32,'Budget 2022'!A32:B70,2,FALSE),\"\")","v":"Andre aktiviteter lokalt (skriv og erstat)"}]
[null,null,null,null,null,null,null,null,null,null,"",null,"",null,"",0,0,null,null,null,null,66,{"$f":"IF('Budget 2022'!B33<>\"(Skriv og erstat)\",VLOOKUP('Bogføring 2022'!V33,'Budget 2022'!$A$33:$B$71,2,FALSE),\"\")","v":"Andre aktiviteter lokalt (skriv og erstat)"}]
[null,null,null,null,null,null,null,null,null,null,"",null,"",null,"",0,0,null,null,null,null,67,{"$f":"IF('Budget 2022'!B34<>\"(Skriv og erstat)\",VLOOKUP('Bogføring 2022'!V34,'Budget 2022'!$A$33:$B$71,2,FALSE),\"\")","v":"Andre aktiviteter lokalt (skriv og erstat)"}]
[null,null,null,null,null,null,null,null,null,null,"",null,"",null,"",0,0,null,null,null,null,68,{"$f":"IF('Budget 2022'!B35<>\"(Skriv og erstat)\",VLOOKUP('Bogføring 2022'!V35,'Budget 2022'!$A$33:$B$71,2,FALSE),\"\")","v":"Andre aktiviteter lokalt (skriv og erstat)"}]
[null,null,null,null,null,null,null,null,null,null,"",null,"",null,"",0,0,null,null,null,null,69,{"$f":"IF('Budget 2022'!B36<>\"(Skriv og erstat)\",VLOOKUP('Bogføring 2022'!V36,'Budget 2022'!$A$33:$B$71,2,FALSE),\"\")","v":"Andre aktiviteter lokalt (skriv og erstat)"}]
[null,null,null,null,null,null,null,null,null,null,"",null,"",null,"",0,0,null,null,null,null,70,{"$f":"IF('Budget 2022'!B37<>\"(Skriv og erstat)\",VLOOKUP('Bogføring 2022'!V37,'Budget 2022'!$A$33:$B$71,2,FALSE),\"\")","v":"Andre aktiviteter lokalt (skriv og erstat)"}]
[null,null,null,null,null,null,null,null,null,null,"",null,"",null,"",0,0,null,null,null,null,71,{"$f":"IF('Budget 2022'!B38<>\"(Skriv og erstat)\",VLOOKUP('Bogføring 2022'!V38,'Budget 2022'!$A$33:$B$71,2,FALSE),\"\")","v":"Andre aktiviteter lokalt (skriv og erstat)"}]
[null,null,null,null,null,null,null,null,null,null,"",null,"",null,"",0,0,null,null,null,null,72,{"$f":"IF('Budget 2022'!B39<>\"(Skriv og erstat)\",VLOOKUP('Bogføring 2022'!V39,'Budget 2022'!$A$33:$B$71,2,FALSE),\"\")","v":"Andre aktiviteter lokalt (skriv og erstat)"}]
[null,null,null,null,null,null,null,null,null,null,"",null,"",null,"",0,0,null,null,null,null,73,{"$f":"IF('Budget 2022'!B40<>\"(Skriv og erstat)\",VLOOKUP('Bogføring 2022'!V40,'Budget 2022'!$A$33:$B$71,2,FALSE),\"\")","v":"Andre aktiviteter lokalt (skriv og erstat)"}]
{"$rows_left_out":462}
{"sheet":"Overblik årsregnskab","index":5,"n_rows":53,"n_cols":9,"rows_kept":53,"cut":false,"hidden":false,"merged":[[49,0,49,4],[1,6,1,8],[1,0,1,4]]}
[]
["Årsregnskab - aktiviteter",null,null,null,null,null,"Økonomisk overblik"]
[null,null,"Værdier"]
["nr.","Aktiviteter","Indtægter","Udgifter"," Budgetteret",null,"Økonomisk status"]
[1,"Nytårsmarch",null,null,0,null,"Åbningssaldo bank 1. jan. 2022",null,{"$f":"IF(_xlfn.NUMBERVALUE('Bogføring 2022'!K2),'Bogføring 2022'!K2,0)","v":0}]
[2,"Hjertecafé",null,null,0,null,"Beholdning bank pr. dags dato ",null,{"$f":"'Bogføring 2022'!J501","v":0}]
[3,"Foredrag",null,null,0,null,"Kontant beholdning (skriv selv beløb)"]
[4,"Hjertemotion",null,null,0,null,"Resultat",null,{"$f":"IF(_xlfn.NUMBERVALUE(I5),I6+I7,\"\")","v":""}]
[5,"Hverveaktiviteter",null,null,0]
[6,"Digitale/online aktiviteter",null,null,0]
[7,"Andre udendørsaktiviteter",null,null,0,null,"Status for indtægter og udgifter"]
[8,"Hjertesti",null,null,0,null,"Indtægter til dags dato",null,{"$f":"GETPIVOTDATA(\"[Measures].[Summen af Indtægt]\",$A$3)","v":0}]
[9,"Hjerteredderkursus (GIV LIV)",null,null,0,null,"Udgifter til dags dato",null,{"$f":"GETPIVOTDATA(\"[Measures].[Summen af Udgift]\",$A$3)","v":0}]
[10,"Landsuddeling 2022",null,null,0,null,"Resultat",null,{"$f":"I12+I13","v":0}]
[11,"Generalforsamling",null,null,0]
[12,"Bestyrelsesmøder",null,null,0]
[13,"Sommerarrangement",null,null,0,null,"Heraf periodiseret "]
[14,"Julearrangement",null,null,0,null,"Forudbetalinger (periodisering)",null,{"$f":"SUMIF('Bogføring 2022'!O3:O500,'Bogføring 2022'!W25,'Bogføring 2022'!P3:P500)+SUMIF('Bogføring 2022'!O3:O500,'Bogføring 2022'!W25,'Bogføring 2022'!Q3:Q500)","v":0}]
[15,"Samarbejde med andre",null,null,0,null,"Manglende omkostninger (ikke afholdt)",null,{"$f":"SUMIF('Bogføring 2022'!O3:O500,'Bogføring 2022'!W26,'Bogføring 2022'!P3:P500)+SUMIF('Bogføring 2022'!O3:O500,'Bogføring 2022'!W26,'Bogføring 2022'!Q3:Q500)","v":0}]
[16,"Netværksarrangementer",null,null,0,null,"Resultat uden periodisering",null,{"$f":"I12+I13-I18-I19","v":0}]
[17,"Kontingenter",null,null,0]
[18,"Udgifter til bankkonto, gebyrer",null,null,0]
[19,"Kontorhold",null,null,0]
[20,"Gaver",null,null,0]
[21,"Frivilliggodtgørelse (telefon og internet)",null,null,0]
[22,"Øvrige",null,null,0]
[23,"§18-midler og tilskud",null,null,0]
[24,"Forudbetalinger (periodisering)",null,null,0]
[25,"Manglende omkostninger (ikke afholdt)",null,null,0]
["Hovedtotal",null,null,null,0]
[]
[]
[]
[]
[]
[]
[]
[]
[]
[]
{"$rows_left_out":14}
{"sheet":"Overblik til print","index":6,"n_rows":28,"n_cols":14,"rows_kept":28,"cut":false,"hidden":true,"merged":[[0,5,0,7]]}
["Aktiviteter","Indtægter","Udgifter","Budgetteret",null,"Økonomisk overblik",null,null,null,null,"Aktiviteter","Indtægter","Udgifter","Budgetteret"]
["§18-midler og tilskud",null,null,0,null,null,null,null,null,null,"(tom)",null,null,0]
["Andre udendørsaktiviteter",null,null,0,null,"Økonomisk status",null,null,null,null,null,0,0,0]
["Bestyrelsesmøder",null,null,0,null,"Åbningssaldo bank 1. jan. 2022",null,{"$f":"IF(_xlfn.NUMBERVALUE('Bogføring 2022'!K2),'Bogføring 2022'!K2,0)","v":0},null,null,"Hovedtotal",0,0,0]
["Digitale/online aktiviteter",null,null,0,null,"Beholdning bank pr. dags dato ",null,{"$f":"'Bogføring 2022'!J501","v":0}]
["Foredrag",null,null,0,null,"Kontant beholdning (skriv selv beløb)"]
["Forudbetalinger (periodisering)",null,null,0,null,"Resultat",null,{"$f":"IF(_xlfn.NUMBERVALUE(H4),H5+H6,\"\")","v":""}]
["Frivilliggodtgørelse (telefon og internet)",null,null,0]
["Gaver",null,null,0]
["Generalforsamling",null,null,0,null,"Status for indtægter og udgifter"]
["Hjertecafé",null,null,0,null,"Indtægter til dags dato",null,{"$f":"GETPIVOTDATA(\"[Measures].[Summen af Indtægt]\",$A$1)","v":0}]
["Hjertemotion",null,null,0,null,"Udgifter til dags dato",null,{"$f":"GETPIVOTDATA(\"[Measures].[Summen af Udgift]\",$A$1)","v":0}]
["Hjerteredderkursus (GIV LIV)",null,null,0,null,"Resultat",null,{"$f":"H11+H12","v":0}]
["Hjertesti",null,null,0]
["Hverveaktiviteter",null,null,0]
["Julearrangement",null,null,0]
["Kontingenter",null,null,0,null," "]
["Kontorhold",null,null,0]
["Landsuddeling 2022",null,null,0]
["Manglende omkostninger (ikke afholdt)",null,null,0]
["Netværksarrangementer",null,null,0]
["Nytårsmarch",null,null,0]
["Samarbejde med andre",null,null,0]
["Sommerarrangement",null,null,0]
["Udgifter til bankkonto, gebyrer",null,null,0]
["Øvrige",null,null,0]
["(tom)",0,0]
["Hovedtotal",0,0,0]

{"sheet":"Kontoplan til print","index":7,"n_rows":40,"n_cols":4,"rows_kept":40,"cut":false,"hidden":false,"merged":[]}
["Kontotypenr.","Kontotype","Aktivitetsnr.","Aktiviteter"]
[100,"Annoncer",1,{"$f":"'Bogføring 2022'!W2","v":"Nytårsmarch"}]
[110,"Transport og kørsel",2,{"$f":"'Bogføring 2022'!W3","v":"Hjertecafé"}]
[120,"Tryksager",3,{"$f":"'Bogføring 2022'!W4","v":"Foredrag"}]
[130,"Forplejning",4,{"$f":"'Bogføring 2022'!W5","v":"Hjertemotion"}]
[140,"Kontorhold",5,{"$f":"'Bogføring 2022'!W6","v":"Hverveaktiviteter"}]
[150,"Gaver",6,{"$f":"'Bogføring 2022'!W7","v":"Digitale/online aktiviteter"}]
[160,"Løn og honorar",7,{"$f":"'Bogføring 2022'!W8","v":"Andre udendørsaktiviteter"}]
[170,"Lokaleleje",8,{"$f":"'Bogføring 2022'!W9","v":"Hjertesti"}]
[180,"Materialer",9,{"$f":"'Bogføring 2022'!W10","v":"Hjerteredderkursus (GIV LIV)"}]
[190,"Licens og software",10,{"$f":"'Bogføring 2022'!W11","v":"Landsuddeling 2022"}]
[200,"Varekøb til videresalg ",11,{"$f":"'Bogføring 2022'!W12","v":"Generalforsamling"}]
[210,"Værnemidler",12,{"$f":"'Bogføring 2022'!W13","v":"Bestyrelsesmøder"}]
[220,"Udgifter til bank",13,{"$f":"'Bogføring 2022'!W14","v":"Sommerarrangement"}]
[230,"Periodisering",14,{"$f":"'Bogføring 2022'!W15","v":"Julearrangement"}]
[240,"Øvrige",15,{"$f":"'Bogføring 2022'!W16","v":"Samarbejde med andre"}]
[null,null,16,{"$f":"'Bogføring 2022'!W17","v":"Netværksarrangementer"}]
[null,null,17,{"$f":"'Bogføring 2022'!W18","v":"Kontingenter"}]
[300,"Tilskud fra HF (indtægt)",18,{"$f":"'Bogføring 2022'!W19","v":"Udgifter til bankkonto, gebyrer"}]
[310,"Sponsorater og donationer (indtægt)",19,{"$f":"'Bogføring 2022'!W20","v":"Kontorhold"}]
[320,"§18/§79-midler (indtægt)",20,{"$f":"'Bogføring 2022'!W21","v":"Gaver"}]
[330,"Deltagerbetaling (indtægt)",21,{"$f":"'Bogføring 2022'!W22","v":"Frivilliggodtgørelse (telefon og internet)"}]
[null,null,22,{"$f":"'Bogføring 2022'!W23","v":"Øvrige"}]
[null,null,23,{"$f":"'Bogføring 2022'!W24","v":"§18-midler og tilskud"}]
[null,null,24,{"$f":"'Bogføring 2022'!W25","v":"Forudbetalinger (periodisering)"}]
[null,null,25,{"$f":"'Bogføring 2022'!W26","v":"Manglende omkostninger (ikke afholdt)"}]
[null,null,60,{"$f":"'Bogføring 2022'!W27","v":"Andre aktiviteter lokalt (skriv og erstat)"}]
[null,null,61,{"$f":"'Bogføring 2022'!W28","v":"Andre aktiviteter lokalt (skriv og erstat)"}]
[null,null,62,{"$f":"'Bogføring 2022'!W29","v":"Andre aktiviteter lokalt (skriv og erstat)"}]
[null,null,63,{"$f":"'Bogføring 2022'!W30","v":"Andre aktiviteter lokalt (skriv og erstat)"}]
[null,null,64,{"$f":"'Bogføring 2022'!W31","v":"Andre aktiviteter lokalt (skriv og erstat)"}]
[null,null,65,{"$f":"'Bogføring 2022'!W32","v":"Andre aktiviteter lokalt (skriv og erstat)"}]
[null,null,66,{"$f":"'Bogføring 2022'!W33","v":"Andre aktiviteter lokalt (skriv og erstat)"}]
[null,null,67,{"$f":"'Bogføring 2022'!W34","v":"Andre aktiviteter lokalt (skriv og erstat)"}]
[null,null,68,{"$f":"'Bogføring 2022'!W35","v":"Andre aktiviteter lokalt (skriv og erstat)"}]
[null,null,69,{"$f":"'Bogføring 2022'!W36","v":"Andre aktiviteter lokalt (skriv og erstat)"}]
[null,null,70,{"$f":"'Bogføring 2022'!W37","v":"Andre aktiviteter lokalt (skriv og erstat)"}]
[null,null,71,{"$f":"'Bogføring 2022'!W38","v":"Andre aktiviteter lokalt (skriv og erstat)"}]
[null,null,72,{"$f":"'Bogføring 2022'!W39","v":"Andre aktiviteter lokalt (skriv og erstat)"}]
[null,null,73,{"$f":"'Bogføring 2022'!W40","v":"Andre aktiviteter lokalt (skriv og erstat)"}]
{"$rows_left_out":1}
{"sheet":"Aktiviteter","index":8,"n_rows":40,"n_cols":2,"rows_kept":40,"cut":false,"hidden":true,"merged":[]}
[{"$f":"'Bogføring 2022'!V1:W40","v":"Aktivitetsnr."},"Aktiviteter"]
[1,"Nytårsmarch"]
[2,"Hjertecafé"]
[3,"Foredrag"]
[4,"Hjertemotion"]
[5,"Hverveaktiviteter"]
[6,"Digitale/online aktiviteter"]
[7,"Andre udendørsaktiviteter"]
[8,"Hjertesti"]
[9,"Hjerteredderkursus (GIV LIV)"]
[10,"Landsuddeling 2022"]
[11,"Generalforsamling"]
[12,"Bestyrelsesmøder"]
[13,"Sommerarrangement"]
[14,"Julearrangement"]
[15,"Samarbejde med andre"]
[16,"Netværksarrangementer"]
[17,"Kontingenter"]
[18,"Udgifter til bankkonto, gebyrer"]
[19,"Kontorhold"]
[20,"Gaver"]
[21,"Frivilliggodtgørelse (telefon og internet)"]
[22,"Øvrige"]
[23,"§18-midler og tilskud"]
[24,"Forudbetalinger (periodisering)"]
[25,"Manglende omkostninger (ikke afholdt)"]
[60,"Andre aktiviteter lokalt (skriv og erstat)"]
[61,"Andre aktiviteter lokalt (skriv og erstat)"]
[62,"Andre aktiviteter lokalt (skriv og erstat)"]
[63,"Andre aktiviteter lokalt (skriv og erstat)"]
[64,"Andre aktiviteter lokalt (skriv og erstat)"]
[65,"Andre aktiviteter lokalt (skriv og erstat)"]
[66,"Andre aktiviteter lokalt (skriv og erstat)"]
[67,"Andre aktiviteter lokalt (skriv og erstat)"]
[68,"Andre aktiviteter lokalt (skriv og erstat)"]
[69,"Andre aktiviteter lokalt (skriv og erstat)"]
[70,"Andre aktiviteter lokalt (skriv og erstat)"]
[71,"Andre aktiviteter lokalt (skriv og erstat)"]
[72,"Andre aktiviteter lokalt (skriv og erstat)"]
[73,"Andre aktiviteter lokalt (skriv og erstat)"]