{"text_format":"1","workbook":"xlsx","n_sheets":11,"sheets":["Ark4","Vejledning til ark","Forside","Budget 2024","Bogføring 2024","Overblik årsregnskab","Overblik kontotyper","Overblik årsregnskab gammel","Overblik til print","Kontoplan til print","Aktiviteter"],"not_rendered":{"charts":0,"images":2,"macros":1,"external_links":0,"defined_names":3,"comments":2,"pivot_tables":7},"unopened":[],"bounds":{"document_bytes":16777216,"sheet_cells":100000,"rows_first":2000,"rows_last":500,"rows_between":2000,"halvings":0,"cell_chars":16384,"cell_head_chars":4096},"cells_cut":0,"cells_raw":0,"read":"whole","date_system":"1900"}

{"sheet":"Ark4","index":0,"n_rows":176,"n_cols":7,"rows_kept":176,"cut":false,"hidden":true,"merged":[]}
[]
[]
[null,null,null,null,"Værdier"]
["Lokalforening","Afleveret","Kontotypenr.","Kontotype","Sum af Indtægt","Sum af Udgift","Sum af Beløb"]
["Hovedtotal"]
[]
[]
[]
[]
[]
[]
[]
[]
[]
[]
[]
[]
[]
[]
[]
[]
[]
[]
[]
[]
[]
[]
[]
[]
[]
{"$rows_left_out":147}
{"sheet":"Vejledning til ark","index":1,"n_rows":22,"n_cols":1,"rows_kept":22,"cut":false,"hidden":false,"merged":[]}
[]
[]
["Vejledning til regnskabsarket"]
["Kære kasserer"]
[]
["Dette er en kort vejledning til, hvordan regnskabsarket skal forstås og udfyldes. "]
["Arket er, i håbet om at være blevet mere intuitivt, bygget op omkring farvekoder. "]
[]
["Felter med farven grøn, skal I udfylde. "]
["Felter med farven gul, kan I udfylde, hvis det er relevant for jer."]
["Felter med farven rød, skal I ikke udfylde."]
[]
["Hvis der herudover skulle være nogen tvivl, henvises der til vores vejledende vidoer fra frivillignet. "]
["Disse er optaget til 2021 regnskabet, men er stadig relevante til 2024 regnskabet. "]
[]
["Se videoerne her:"]
["1.Præsentation"]
["2. Forside"]
["3. Budget og tilføjelse af aktiviteter"]
["4. Kontoplan"]
["5. Eksempel på bogføring"]
["6. Periodisering"]

{"sheet":"Forside","index":2,"n_rows":36,"n_cols":10,"rows_kept":36,"cut":false,"hidden":false,"merged":[[7,2,7,6],[8,2,8,6],[9,2,9,6],[13,1,15,6],[1,1,1,6],[2,1,3,6],[4,2,4,6],[5,2,5,6],[6,2,6,6]]}
[null,null,null,null,null,null,null,null,"Elektronisk","Hovedstaden"]
[null,null,null,null,null,null,null,null,"Fysisk","Sjælland"]
[null,"Årsregnskab 2024",null,null,null,null,null,null,null,"Syd"]
[null,null,null,null,null,null,null,null,null,"Nord"]
[null,"Region",null,null,null,null,null,null,null,"Midt"]
[null,"Lokalforening/Klub"]
[null,"Kassererens navn"]
[null,"Kassererens e-mailadresse"]
[null,"Dato for indsendelse af regnskab"]
[null,"Regnskab aflægges fysisk el. elektronisk","Elektronisk"]
[]
[]
[null,"Bemærkninger til regnskabet"]
[]
[]
[]
[]
[]
[]
[null,"Økonomisk status"]
[null,"Åbningssaldo bank 1. jan. 2024",null,{"$f":"'Overblik årsregnskab gammel'!J5","v":0}]
[null,"Beholdning bank pr. dags dato ",null,{"$f":"'Overblik årsregnskab gammel'!J6","v":0}]
[null,"Kontant beholdning",null,{"$f":"'Overblik årsregnskab'!J7","v":0}]
[null,"Resultat",null,{"$f":"D22+D23","v":0}]
[]
[]
[]
[]
[]
[]
{"$rows_left_out":7}
{"sheet":"Budget 2024","index":3,"n_rows":40,"n_cols":3,"rows_kept":40,"cut":false,"hidden":false,"merged":[]}
["Aktivitetsnr.","Aktiviteter","Budgetteret "]
[1,"Nytårsmarch",0]
[2,"Hjertecafé",0]
[3,"Foredrag",0]
[4,"Hjertemotion",0]
[5,"Hjerteredderkursus (Giv Liv)",0]
[6,"Gå Med "]
[7,"Hjertesti",0]
[8,"Hverveaktiviteter (events og messer)",0]
[9,"Generalforsamling",0]
[10,"Bestyrelsesmøder",0]
[11,"Sommerarrangement (frivillige)",0]
[12,"Julearrangement (frivillige)",0]
[13,"Samarbejde med andre",0]
[14,"Kontingenter",0]
[15,"Udgifter til bankkonto, gebyrer",0]
[16,"Kontorhold",0]
[17,"Gaver ",0]
[18,"Frivilliggodtgørelse (telefon og internet)",0]
[19,"Øvrige",0]
[20,"§18-midler og tilskud",0]
[21,"Forudbetalinger (periodisering)",0]
[22,"Manglende omkostninger (ikke afholdt)",0]
[60,"Andre aktiviteter lokalt (skriv og erstat)"]
[61,"Andre aktiviteter lokalt (skriv og erstat)"]
[62,"Andre aktiviteter lokalt (skriv og erstat)"]
[63,"Andre aktiviteter lokalt (skriv og erstat)"]
[64,"Andre aktiviteter lokalt (skriv og erstat)"]
[65,"Andre aktiviteter lokalt (skriv og erstat)"]
[66,"Andre aktiviteter lokalt (skriv og erstat)"]
{"$rows_left_out":11}
{"sheet":"Bogføring 2024","index":4,"n_rows":501,"n_cols":23,"rows_kept":501,"cut":false,"hidden":false,"merged":[]}
["Region","Lokalforening","Kassererens Navn","Kassererens e-mail-adresse","Regnskab sendt dato","Afleveret","Bilagsnr.","Dato","Præcis bilagstekst","Beløb","Saldo","Kontotypenr.","Kontotype","Aktivitetsnr.","Aktivitet","Indtægt","Udgift",null,null,"Kontotypenr.","Kontotype","Aktivitetsnr.","Aktiviteter"]
[null,null,null,null,null,null,null,null,null,null,null,null,null,null,null,null,null,null,null,100,"Annoncer",1,{"$f":"IF('Budget 2024'!B2<>\"(Skriv og erstat)\",VLOOKUP('Bogføring 2024'!V2,'Budget 2024'!A2:B43,2,FALSE),\"\")","v":"Nytårsmarch"}]
[{"$f":"Forside!C5","v":0},{"$f":"Forside!C6","v":0},{"$f":"Forside!C7","v":0},{"$f":"Forside!C8","v":0},{"$f":"Forside!C9","v":"00:00:00"},{"$f":"Forside!C10","v":"Elektronisk"},null,null,null,null,{"$f":"IF(_xlfn.NUMBERVALUE(J3),K2+J3,\"\")","v":""},null,{"$f":"IF(ISNA(VLOOKUP(L3,$T$1:$U$40,2,FALSE)),\"\",VLOOKUP(L3,$T$1:$U$40,2,FALSE))","v":""},null,{"$f":"IF(ISNA(VLOOKUP(N3,$V$1:$W$40,2,FALSE)),\"\",VLOOKUP(N3,$V$1:$W$40,2,FALSE))","v":""},{"$f":"IF(J3>0,J3,0)","v":0},{"$f":"IF(J3<0,J3,0)","v":0},null,null,110,"Transport og kørsel",2,{"$f":"IF('Budget 2024'!B3<>\"(Skriv og erstat)\",VLOOKUP('Bogføring 2024'!V3,'Budget 2024'!A3:B44,2,FALSE),\"\")","v":"Hjertecafé"}]
[{"$f":"A3","v":0},0,0,0,"00:00:00","Elektronisk",null,null,null,null,"",null,{"$f":"IF(ISNA(VLOOKUP(L4,$T$1:$U$40,2,FALSE)),\"\",VLOOKUP(L4,$T$1:$U$40,2,FALSE))","v":""},null,"",{"$f":"IF(J4>0,J4,0)","v":0},{"$f":"IF(J4<0,J4,0)","v":0},null,null,120,"Tryksager",3,{"$f":"IF('Budget 2024'!B4<>\"(Skriv og erstat)\",VLOOKUP('Bogføring 2024'!V4,'Budget 2024'!A4:B45,2,FALSE),\"\")","v":"Foredrag"}]
[null,null,null,null,null,null,null,null,null,null,"",null,"",null,"",0,0,null,null,130,"Forplejning",4,{"$f":"IF('Budget 2024'!B5<>\"(Skriv og erstat)\",VLOOKUP('Bogføring 2024'!V5,'Budget 2024'!A5:B46,2,FALSE),\"\")","v":"Hjertemotion"}]
[null,null,null,null,null,null,null,null,null,null,"",null,"",null,"",0,0,null,null,140,"Kontorhold",5,{"$f":"IF('Budget 2024'!B6<>\"(Skriv og erstat)\",VLOOKUP('Bogføring 2024'!V6,'Budget 2024'!A6:B47,2,FALSE),\"\")","v":"Hjerteredderkursus (Giv Liv)"}]
[null,null,null,null,null,null,null,null,null,null,"",null,"",null,"",0,0,null,null,150,"Gaver",6,{"$f":"IF('Budget 2024'!B7<>\"(Skriv og erstat)\",VLOOKUP('Bogføring 2024'!V7,'Budget 2024'!A7:B48,2,FALSE),\"\")","v":"Gå Med "}]
[null,null,null,null,null,null,null,null,null,null,"",null,"",null,"",0,0,null,null,160,"Løn og honorar",7,{"$f":"IF('Budget 2024'!B8<>\"(Skriv og erstat)\",VLOOKUP('Bogføring 2024'!V8,'Budget 2024'!A8:B49,2,FALSE),\"\")","v":"Hjertesti"}]
[null,null,null,null,null,null,null,null,null,null,"",null,"",null,"",0,0,null,null,170,"Lokaleleje",8,{"$f":"IF('Budget 2024'!B9<>\"(Skriv og erstat)\",VLOOKUP('Bogføring 2024'!V9,'Budget 2024'!A9:B50,2,FALSE),\"\")","v":"Hverveaktiviteter (events og messer)"}]
[null,null,null,null,null,null,null,null,null,null,"",null,"",null,"",0,0,null,null,180,"Materialer",9,{"$f":"IF('Budget 2024'!B10<>\"(Skriv og erstat)\",VLOOKUP('Bogføring 2024'!V10,'Budget 2024'!A10:B51,2,FALSE),\"\")","v":"Generalforsamling"}]
[null,null,null,null,null,null,null,null,null,null,"",null,"",null,"",0,0,null,null,190,"Licens og software",10,{"$f":"IF('Budget 2024'!B11<>\"(Skriv og erstat)\",VLOOKUP('Bogføring 2024'!V11,'Budget 2024'!A11:B52,2,FALSE),\"\")","v":"Bestyrelsesmøder"}]
[null,null,null,null,null,null,null,null,null,null,"",null,"",null,"",0,0,null,null,200,"Varekøb til videresalg ",11,{"$f":"IF('Budget 2024'!B12<>\"(Skriv og erstat)\",VLOOKUP('Bogføring 2024'!V12,'Budget 2024'!A12:B53,2,FALSE),\"\")","v":"Sommerarrangement (frivillige)"}]
[null,null,null,null,null,null,null,null,null,null,"",null,"",null,"",0,0,null,null,210,"Værnemidler",12,{"$f":"IF('Budget 2024'!B13<>\"(Skriv og erstat)\",VLOOKUP('Bogføring 2024'!V13,'Budget 2024'!A13:B54,2,FALSE),\"\")","v":"Julearrangement (frivillige)"}]
[null,null,null,null,null,null,null,null,null,null,"",null,"",null,"",0,0,null,null,220,"Udgifter til bank",13,{"$f":"IF('Budget 2024'!B14<>\"(Skriv og erstat)\",VLOOKUP('Bogføring 2024'!V14,'Budget 2024'!A14:B55,2,FALSE),\"\")","v":"Samarbejde med andre"}]
[null,null,null,null,null,null,null,null,null,null,"",null,"",null,"",0,0,null,null,230,"Periodisering",14,{"$f":"IF('Budget 2024'!B15<>\"(Skriv og erstat)\",VLOOKUP('Bogføring 2024'!V15,'Budget 2024'!A15:B56,2,FALSE),\"\")","v":"Kontingenter"}]
[null,null,null,null,null,null,null,null,null,null,"",null,"",null,"",0,0,null,null,240,"Øvrige",15,{"$f":"IF('Budget 2024'!B16<>\"(Skriv og erstat)\",VLOOKUP('Bogføring 2024'!V16,'Budget 2024'!A16:B57,2,FALSE),\"\")","v":"Udgifter til bankkonto, gebyrer"}]
[null,null,null,null,null,null,null,null,null,null,"",null,"",null,"",0,0,null,null,null,null,16,{"$f":"IF('Budget 2024'!B17<>\"(Skriv og erstat)\",VLOOKUP('Bogføring 2024'!V17,'Budget 2024'!A17:B58,2,FALSE),\"\")","v":"Kontorhold"}]
[null,null,null,null,null,null,null,null,null,null,"",null,"",null,"",0,0,null,null,null,null,17,{"$f":"IF('Budget 2024'!B18<>\"(Skriv og erstat)\",VLOOKUP('Bogføring 2024'!V18,'Budget 2024'!A18:B59,2,FALSE),\"\")","v":"Gaver "}]
[null,null,null,null,null,null,null,null,null,null,"",null,"",null,"",0,0,null,null,300,"Tilskud fra HF (indtægt)",18,{"$f":"IF('Budget 2024'!B19<>\"(Skriv og erstat)\",VLOOKUP('Bogføring 2024'!V19,'Budget 2024'!A19:B60,2,FALSE),\"\")","v":"Frivilliggodtgørelse (telefon og internet)"}]
[null,null,null,null,null,null,null,null,null,null,"",null,"",null,"",0,0,null,null,310,"Sponsorater og donationer (indtægt)",19,{"$f":"IF('Budget 2024'!B20<>\"(Skriv og erstat)\",VLOOKUP('Bogføring 2024'!V20,'Budget 2024'!A20:B61,2,FALSE),\"\")","v":"Øvrige"}]
[null,null,null,null,null,null,null,null,null,null,"",null,"",null,"",0,0,null,null,320,"§18/§79-midler (indtægt)",20,{"$f":"IF('Budget 2024'!B21<>\"(Skriv og erstat)\",VLOOKUP('Bogføring 2024'!V21,'Budget 2024'!A21:B62,2,FALSE),\"\")","v":"§18-midler og tilskud"}]
[null,null,null,null,null,null,null,null,null,null,"",null,"",null,"",0,0,null,null,330,"Deltagerbetaling (indtægt)",21,{"$f":"IF('Budget 2024'!B22<>\"(Skriv og erstat)\",VLOOKUP('Bogføring 2024'!V22,'Budget 2024'!A22:B63,2,FALSE),\"\")","v":"Forudbetalinger (periodisering)"}]
[null,null,null,null,null,null,null,null,null,null,"",null,"",null,"",0,0,null,null,null,null,22,{"$f":"IF('Budget 2024'!B23<>\"(Skriv og erstat)\",VLOOKUP('Bogføring 2024'!V23,'Budget 2024'!A23:B64,2,FALSE),\"\")","v":"Manglende omkostninger (ikke afholdt)"}]
[null,null,null,null,null,null,null,null,null,null,"",null,"",null,"",0,0,null,null,null,null,60,{"$f":"IF('Budget 2024'!B24<>\"(Skriv og erstat)\",VLOOKUP('Bogføring 2024'!V24,'Budget 2024'!A24:B65,2,FALSE),\"\")","v":"Andre aktiviteter lokalt (skriv og erstat)"}]
[null,null,null,null,null,null,null,null,null,null,"",null,"",null,"",0,0,null,null,null,null,61,{"$f":"IF('Budget 2024'!B25<>\"(Skriv og erstat)\",VLOOKUP('Bogføring 2024'!V25,'Budget 2024'!A25:B66,2,FALSE),\"\")","v":"Andre aktiviteter lokalt (skriv og erstat)"}]
[null,null,null,null,null,null,null,null,null,null,"",null,"",null,"",0,0,null,null,null,null,62,{"$f":"IF('Budget 2024'!B26<>\"(Skriv og erstat)\",VLOOKUP('Bogføring 2024'!V26,'Budget 2024'!A26:B67,2,FALSE),\"\")","v":"Andre aktiviteter lokalt (skriv og erstat)"}]
[null,null,null,null,null,null,null,null,null,null,"",null,"",null,"",0,0,null,null,null,null,63,{"$f":"IF('Budget 2024'!B27<>\"(Skriv og erstat)\",VLOOKUP('Bogføring 2024'!V27,'Budget 2024'!A27:B68,2,FALSE),\"\")","v":"Andre aktiviteter lokalt (skriv og erstat)"}]
[null,null,null,null,null,null,null,null,null,null,"",null,"",null,"",0,0,null,null,null,null,64,{"$f":"IF('Budget 2024'!B28<>\"(Skriv og erstat)\",VLOOKUP('Bogføring 2024'!V28,'Budget 2024'!A28:B69,2,FALSE),\"\")","v":"Andre aktiviteter lokalt (skriv og erstat)"}]
[null,null,null,null,null,null,null,null,null,null,"",null,"",null,"",0,0,null,null,null,null,65,{"$f":"IF('Budget 2024'!B29<>\"(Skriv og erstat)\",VLOOKUP('Bogføring 2024'!V29,'Budget 2024'!A29:B70,2,FALSE),\"\")","v":"Andre aktiviteter lokalt (skriv og erstat)"}]
[null,null,null,null,null,null,null,null,null,null,"",null,"",null,"",0,0,null,null,null,null,66,{"$f":"IF('Budget 2024'!B30<>\"(Skriv og erstat)\",VLOOKUP('Bogføring 2024'!V30,'Budget 2024'!A30:B71,2,FALSE),\"\")","v":"Andre aktiviteter lokalt (skriv og erstat)"}]
{"$rows_left_out":472}
{"sheet":"Overblik årsregnskab","index":5,"n_rows":25,"n_cols":10,"rows_kept":25,"cut":false,"hidden":false,"merged":[[0,0,1,5],[0,7,1,9]]}
["Overblik årsregnskab",null,null,null,null,null,null,"Økonomisk overblik"]
[]
["Nr.","Aktivitet","Indtægter","Udgifter","Budgetteret","Rest budget"]
[1,"Nytårsmarch",null,null,0,0,null,"Økonomisk status"]
[2,"Hjertecafé",null,null,0,0,null,"Åbningssaldo bank 1. jan. 2024",null,{"$f":"IF(_xlfn.NUMBERVALUE('Bogføring 2024'!K2),'Bogføring 2024'!K2,0)","v":0}]
[3,"Foredrag",null,null,0,0,null,"Beholdning bank pr. dags dato ",null,{"$f":"'Bogføring 2024'!J501","v":0}]
[4,"Hjertemotion",null,null,0,0,null,"Kontant beholdning (skriv selv beløb)"]
[5,"Hjerteredderkursus (Giv Liv)",null,null,0,0,null,"Resultat",null,{"$f":"IF(_xlfn.NUMBERVALUE(J5),J6+J7,\"\")","v":""}]
[7,"Hjertesti",null,null,0,0]
[8,"Hverveaktiviteter (events og messer)",null,null,0,0]
[9,"Generalforsamling",null,null,0,0,null,"Status for indtægter og udgifter"]
[10,"Bestyrelsesmøder",null,null,0,0,null,"Indtægter til dags dato",null,{"$f":"GETPIVOTDATA(\"[Measures].[Summen af Indtægt]\",$A$3)","v":0}]
[11,"Sommerarrangement (frivillige)",null,null,0,0,null,"Udgifter til dags dato",null,{"$f":"GETPIVOTDATA(\"[Measures].[Summen af Udgift]\",$A$3)","v":0}]
[12,"Julearrangement (frivillige)",null,null,0,0,null,"Resultat",null,{"$f":"J12+J13","v":0}]
[13,"Samarbejde med andre",null,null,0,0]
[14,"Kontingenter",null,null,0,0]
[15,"Udgifter til bankkonto, gebyrer",null,null,0,0,null,"Heraf periodiseret "]
[16,"Kontorhold",null,null,0,0,null,"Forudbetalinger (periodisering)",null,{"$f":"SUMIF('Bogføring 2024'!O3:O500,'Bogføring 2024'!W22,'Bogføring 2024'!P3:P500)+SUMIF('Bogføring 2024'!O3:O500,'Bogføring 2024'!W22,'Bogføring 2024'!Q3:Q500)","v":0}]
[17,"Gaver",null,null,0,0,null,"Manglende omkostninger (ikke afholdt)",null,{"$f":"SUMIF('Bogføring 2024'!O3:O500,'Bogføring 2024'!W23,'Bogføring 2024'!P3:P500)+SUMIF('Bogføring 2024'!O3:O500,'Bogføring 2024'!W23,'Bogføring 2024'!Q3:Q500)","v":0}]
[18,"Frivilliggodtgørelse (telefon og internet)",null,null,0,0,null,"Resultat uden periodisering",null,{"$f":"J12+J13-J18-J19","v":0}]
[19,"Øvrige",null,null,0,0]
[20,"§18-midler og tilskud",null,null,0,0,null," "]
[21,"Forudbetalinger (periodisering)",null,null,0,0]
[22,"Manglende omkostninger (ikke afholdt)",null,null,0,0]
["Hovedtotal",null,null,null,0,0]

{"sheet":"Overblik kontotyper","index":6,"n_rows":5,"n_cols":7,"rows_kept":5,"cut":false,"hidden":false,"merged":[[0,0,1,6]]}
["Overblik kontoplan"]
[]
["Aktivitetsnr.","Aktiviteter","Kontotypenr.","Kontotype","Summen af Indtægt","Summen af Udgift","Resultat"]
["(tom)",null,null,null,0,0,0]
["Hovedtotal",null,null,null,0,0,0]

{"sheet":"Overblik årsregnskab gammel","index":7,"n_rows":41,"n_cols":10,"rows_kept":41,"cut":false,"hidden":true,"merged":[[49,0,49,4],[1,0,1,4],[1,7,1,9]]}
[]
["Årsregnskab - aktiviteter",null,null,null,null,null,null,"Økonomisk overblik"]
[null,null,"Værdier"]
["nr.","Aktiviteter","Indtægter","Udgifter"," Budgetteret","Rest budget",null,"Økonomisk status"]
[1,"Nytårsmarch",null,null,0,{"$f":"SUM(C5:E5)","v":0},null,"Åbningssaldo bank 1. jan. 2023",null,{"$f":"IF(_xlfn.NUMBERVALUE('Bogføring 2024'!K2),'Bogføring 2024'!K2,0)","v":0}]
[2,"Hjertecafé",null,null,0,0,null,"Beholdning bank pr. dags dato ",null,{"$f":"'Bogføring 2024'!J501","v":0}]
[3,"Foredrag",null,null,0,0,null,"Kontant beholdning (skriv selv beløb)"]
[4,"Hjertemotion",null,null,0,0,null,"Resultat",null,{"$f":"IF(_xlfn.NUMBERVALUE(J5),J6+J7,\"\")","v":""}]
[5,"Hjerteredderkursus (Giv Liv)",null,null,0,0]
[7,"Hjertesti",null,null,0,0]
[8,"Hverveaktiviteter (events og messer)",null,null,0,0,null,"Status for indtægter og udgifter"]
[9,"Generalforsamling",null,null,0,0,null,"Indtægter til dags dato",null,{"$f":"GETPIVOTDATA(\"[Measures].[Summen af Indtægt]\",$A$3)","v":0}]
[10,"Bestyrelsesmøder",null,null,0,0,null,"Udgifter til dags dato",null,{"$f":"GETPIVOTDATA(\"[Measures].[Summen af Udgift]\",$A$3)","v":0}]
[11,"Sommerarrangement (frivillige)",null,null,0,0,null,"Resultat",null,{"$f":"J12+J13","v":0}]
[12,"Julearrangement (frivillige)",null,null,0,0]
[13,"Samarbejde med andre",null,null,0,0]
[14,"Kontingenter",null,null,0,0,null,"Heraf periodiseret "]
[15,"Udgifter til bankkonto, gebyrer",null,null,0,0,null,"Forudbetalinger (periodisering)",null,{"$f":"SUMIF('Bogføring 2024'!O3:O500,'Bogføring 2024'!W22,'Bogføring 2024'!P3:P500)+SUMIF('Bogføring 2024'!O3:O500,'Bogføring 2024'!W22,'Bogføring 2024'!Q3:Q500)","v":0}]
[16,"Kontorhold",null,null,0,0,null,"Manglende omkostninger (ikke afholdt)",null,{"$f":"SUMIF('Bogføring 2024'!O3:O500,'Bogføring 2024'!W23,'Bogføring 2024'!P3:P500)+SUMIF('Bogføring 2024'!O3:O500,'Bogføring 2024'!W23,'Bogføring 2024'!Q3:Q500)","v":0}]
[17,"Gaver",null,null,0,0,null,"Resultat uden periodisering",null,{"$f":"J12+J13-J18-J19","v":0}]
[18,"Frivilliggodtgørelse (telefon og internet)",null,null,0,0]
[19,"Øvrige",null,null,0,0]
[20,"§18-midler og tilskud",null,null,0,0]
[21,"Forudbetalinger (periodisering)",null,null,0,0]
[22,"Manglende omkostninger (ikke afholdt)",null,null,0,0]
["Hovedtotal",null,null,null,0,0]
[null,null,null,null,null,0]
[null,null,null,null,null,0]
[null,null,null,null,null,0]
[null,null,null,null,null,0]
{"$rows_left_out":12}
{"sheet":"Overblik til print","index":8,"n_rows":24,"n_cols":14,"rows_kept":24,"cut":false,"hidden":true,"merged":[[0,5,0,7]]}
["Aktiviteter","Indtægter","Udgifter","Budgetteret",null,"Økonomisk overblik",null,null,null,null,"Aktiviteter","Indtægter","Udgifter","Budgetteret"]
["§18-midler og tilskud",null,null,0,null,null,null,null,null,null,"(tom)",null,null,0]
["Bestyrelsesmøder",null,null,0,null,"Økonomisk status",null,null,null,null,null,0,0,0]
["Foredrag",null,null,0,null,"Åbningssaldo bank 1. jan. 2022",null,{"$f":"IF(_xlfn.NUMBERVALUE('Bogføring 2024'!K2),'Bogføring 2024'!K2,0)","v":0},null,null,"Hovedtotal",0,0,0]
["Forudbetalinger (periodisering)",null,null,0,null,"Beholdning bank pr. dags dato ",null,{"$f":"'Bogføring 2024'!J501","v":0}]
["Frivilliggodtgørelse (telefon og internet)",null,null,0,null,"Kontant beholdning (skriv selv beløb)"]
["Gaver",null,null,0,null,"Resultat",null,{"$f":"IF(_xlfn.NUMBERVALUE(H4),H5+H6,\"\")","v":""}]
["Generalforsamling",null,null,0]
["Hjertecafé",null,null,0]
["Hjertemotion",null,null,0,null,"Status for indtægter og udgifter"]
["Hjerteredderkursus (Giv Liv)",null,null,0,null,"Indtægter til dags dato",null,{"$f":"GETPIVOTDATA(\"[Measures].[Summen af Indtægt]\",$A$1)","v":0}]
["Hjertesti",null,null,0,null,"Udgifter til dags dato",null,{"$f":"GETPIVOTDATA(\"[Measures].[Summen af Udgift]\",$A$1)","v":0}]
["Hverveaktiviteter (events og messer)",null,null,0,null,"Resultat",null,{"$f":"H11+H12","v":0}]
["Julearrangement (frivillige)",null,null,0]
["Kontingenter",null,null,0]
["Kontorhold",null,null,0]
["Manglende omkostninger (ikke afholdt)",null,null,0,null," "]
["Nytårsmarch",null,null,0]
["Samarbejde med andre",null,null,0]
["Sommerarrangement (frivillige)",null,null,0]
["Udgifter til bankkonto, gebyrer",null,null,0]
["Øvrige",null,null,0]
["(tom)",0,0]
["Hovedtotal",0,0,0]

{"sheet":"Kontoplan til print","index":9,"n_rows":40,"n_cols":4,"rows_kept":40,"cut":false,"hidden":false,"merged":[]}
["Kontotypenr.","Kontotype","Aktivitetsnr.","Aktiviteter"]
[100,"Annoncer",1,{"$f":"'Bogføring 2024'!W2","v":"Nytårsmarch"}]
[110,"Transport og kørsel",2,{"$f":"'Bogføring 2024'!W3","v":"Hjertecafé"}]
[120,"Tryksager",3,{"$f":"'Bogføring 2024'!W4","v":"Foredrag"}]
[130,"Forplejning",4,{"$f":"'Bogføring 2024'!W5","v":"Hjertemotion"}]
[140,"Kontorhold",5,{"$f":"'Bogføring 2024'!W6","v":"Hjerteredderkursus (Giv Liv)"}]
[150,"Gaver",6,{"$f":"'Bogføring 2024'!W7","v":"Gå Med "}]
[160,"Løn og honorar",7,{"$f":"'Bogføring 2024'!W8","v":"Hjertesti"}]
[170,"Lokaleleje",8,{"$f":"'Bogføring 2024'!W9","v":"Hverveaktiviteter (events og messer)"}]
[180,"Materialer",9,{"$f":"'Bogføring 2024'!W10","v":"Generalforsamling"}]
[190,"Licens og software",10,{"$f":"'Bogføring 2024'!W11","v":"Bestyrelsesmøder"}]
[200,"Varekøb til videresalg ",11,{"$f":"'Bogføring 2024'!W12","v":"Sommerarrangement (frivillige)"}]
[210,"Værnemidler",12,{"$f":"'Bogføring 2024'!W13","v":"Julearrangement (frivillige)"}]
[220,"Udgifter til bank",13,{"$f":"'Bogføring 2024'!W14","v":"Samarbejde med andre"}]
[230,"Periodisering",14,{"$f":"'Bogføring 2024'!W15","v":"Kontingenter"}]
[240,"Øvrige",15,{"$f":"'Bogføring 2024'!W16","v":"Udgifter til bankkonto, gebyrer"}]
[null,null,16,{"$f":"'Bogføring 2024'!W17","v":"Kontorhold"}]
[null,null,17,{"$f":"'Bogføring 2024'!W18","v":"Gaver "}]
[300,"Tilskud fra HF (indtægt)",18,{"$f":"'Bogføring 2024'!W19","v":"Frivilliggodtgørelse (telefon og internet)"}]
[310,"Sponsorater og donationer (indtægt)",19,{"$f":"'Bogføring 2024'!W20","v":"Øvrige"}]
[320,"§18/§79-midler (indtægt)",20,{"$f":"'Bogføring 2024'!W21","v":"§18-midler og tilskud"}]
[330,"Deltagerbetaling (indtægt)",21,{"$f":"'Bogføring 2024'!W22","v":"Forudbetalinger (periodisering)"}]
[null,null,22,{"$f":"'Bogføring 2024'!W23","v":"Manglende omkostninger (ikke afholdt)"}]
[null,null,60,{"$f":"'Bogføring 2024'!W24","v":"Andre aktiviteter lokalt (skriv og erstat)"}]
[null,null,61,{"$f":"'Bogføring 2024'!W25","v":"Andre aktiviteter lokalt (skriv og erstat)"}]
[null,null,62,{"$f":"'Bogføring 2024'!W26","v":"Andre aktiviteter lokalt (skriv og erstat)"}]
[null,null,63,{"$f":"'Bogføring 2024'!W27","v":"Andre aktiviteter lokalt (skriv og erstat)"}]
[null,null,64,{"$f":"'Bogføring 2024'!W28","v":"Andre aktiviteter lokalt (skriv og erstat)"}]
[null,null,65,{"$f":"'Bogføring 2024'!W29","v":"Andre aktiviteter lokalt (skriv og erstat)"}]
[null,null,66,{"$f":"'Bogføring 2024'!W30","v":"Andre aktiviteter lokalt (skriv og erstat)"}]
{"$rows_left_out":11}
{"sheet":"Aktiviteter","index":10,"n_rows":40,"n_cols":2,"rows_kept":40,"cut":false,"hidden":true,"merged":[]}
[{"$f":"'Bogføring 2024'!V1:W40","v":"Aktivitetsnr."},"Aktiviteter"]
[1,"Nytårsmarch"]
[2,"Hjertecafé"]
[3,"Foredrag"]
[4,"Hjertemotion"]
[5,"Hjerteredderkursus (Giv Liv)"]
[6,"Gå Med "]
[7,"Hjertesti"]
[8,"Hverveaktiviteter (events og messer)"]
[9,"Generalforsamling"]
[10,"Bestyrelsesmøder"]
[11,"Sommerarrangement (frivillige)"]
[12,"Julearrangement (frivillige)"]
[13,"Samarbejde med andre"]
[14,"Kontingenter"]
[15,"Udgifter til bankkonto, gebyrer"]
[16,"Kontorhold"]
[17,"Gaver "]
[18,"Frivilliggodtgørelse (telefon og internet)"]
[19,"Øvrige"]
[20,"§18-midler og tilskud"]
[21,"Forudbetalinger (periodisering)"]
[22,"Manglende omkostninger (ikke afholdt)"]
[60,"Andre aktiviteter lokalt (skriv og erstat)"]
[61,"Andre aktiviteter lokalt (skriv og erstat)"]
[62,"Andre aktiviteter lokalt (skriv og erstat)"]
[63,"Andre aktiviteter lokalt (skriv og erstat)"]
[64,"Andre aktiviteter lokalt (skriv og erstat)"]
[65,"Andre aktiviteter lokalt (skriv og erstat)"]
[66,"Andre aktiviteter lokalt (skriv og erstat)"]
{"$rows_left_out":10}