{"text_format":"1","workbook":"xlsx","n_sheets":12,"sheets":["Ark4","Vejledning til ark","Forside","Budget 2026","Bogføring 2026","Overblik årsregnskab","Overblik sponsorater","Overblik kontotyper","Overblik årsregnskab gammel","Overblik til print","Kontoplan til print","Aktiviteter"],"not_rendered":{"charts":0,"images":4,"macros":1,"external_links":0,"defined_names":9,"comments":3,"pivot_tables":8},"unopened":[],"bounds":{"document_bytes":16777216,"sheet_cells":100000,"rows_first":2000,"rows_last":500,"rows_between":2000,"halvings":0,"cell_chars":16384,"cell_head_chars":4096},"cells_cut":0,"cells_raw":0,"read":"whole","date_system":"1900"}

{"sheet":"Ark4","index":0,"n_rows":176,"n_cols":7,"rows_kept":176,"cut":false,"hidden":true,"merged":[]}
[]
[]
[null,null,null,null,"Værdier"]
["Lokalforening","Afleveret","Kontotypenr.","Kontotype","Sum af Indtægt","Sum af Udgift","Sum af Beløb"]
["Hovedtotal"]
[]
[]
[]
[]
[]
[]
[]
[]
[]
[]
[]
[]
[]
[]
[]
{"$rows_left_out":157}
{"sheet":"Vejledning til ark","index":1,"n_rows":29,"n_cols":1,"rows_kept":29,"cut":false,"hidden":false,"merged":[[23,0,23,6],[24,0,24,2],[25,0,25,7],[27,0,27,4],[28,0,28,3],[22,0,22,6],[8,0,8,3],[10,0,10,7],[11,0,11,3],[12,0,12,6],[13,0,13,4],[15,0,15,4],[16,0,16,6],[17,0,17,7],[18,0,18,6],[19,0,19,6],[20,0,20,3],[7,0,7,5],[0,0,0,4],[1,0,1,1],[3,0,3,6],[4,0,4,6],[6,0,6,3]]}
["Vejledning til regnskabsarket"]
["Kære kasserer"]
[]
["Dette er en kort vejledning til, hvordan regnskabsarket skal forstås og udfyldes. "]
["Arket er, i håbet om at være blevet mere intuitivt, bygget op omkring farvekoder. "]
[]
["Felter med farven grøn, skal I udfylde. "]
["Felter med farven gul, kan I udfylde, hvis det er relevant for jer."]
["Felter med farven rød, skal I ikke udfylde."]
[]
["Vi opfordrer alle kasserer til at, se den aktuelle video på frivillignet, før du går i gang "]
["med at udfylde regnskabsskemaet."]
["I videoen vil du blive guidet i korrekt bogføring og hvordan i bruger regnskabs- "]
["arket til at få overblik over jeres økonomi i løbet af året. "]
[]
["Hurtigt guide til dig som vil i gang med det samme:"]
["1.  Udfyld forsiden med korrekt oplysninger på dig som kasserer og jeres forening."]
["2. Udfyld budgetfanen med de godkendte budgetposter fra jeres godkendte bevilling.   "]
["3. Udfyld bogføring med startsalto i det grønne helt i toppen af skemaet.  "]
["4. Du er nu klar til at bogføre - bilag nummer, dato, bilag tekst, kontotype, og "]
{"$rows_left_out":10}
{"sheet":"Forside","index":2,"n_rows":33,"n_cols":10,"rows_kept":33,"cut":false,"hidden":false,"merged":[[7,2,7,6],[8,2,8,6],[9,2,9,6],[13,1,15,6],[1,1,1,6],[2,1,3,6],[4,2,4,6],[5,2,5,6],[6,2,6,6]]}
[null,null,null,null,null,null,null,null,"Elektronisk","Hovedstaden"]
[null,null,null,null,null,null,null,null,"Fysisk","Sjælland"]
[null,"Årsregnskab 2026",null,null,null,null,null,null,null,"Syd"]
[null,null,null,null,null,null,null,null,null,"Nord"]
[null,"Region",null,null,null,null,null,null,null,"Midt"]
[null,"Lokalforening/Klub"]
[null,"Kassererens navn"]
[null,"Kassererens e-mailadresse"]
[null,"Dato for indsendelse af regnskab"]
[null,"Regnskab aflægges elektronisk","Elektronisk"]
[]
[]
[null,"Bemærkninger til regnskabet"]
[]
[]
[]
[]
[]
[]
[null,"Økonomisk status - overføres automatisk "]
{"$rows_left_out":14}
{"sheet":"Budget 2026","index":3,"n_rows":40,"n_cols":3,"rows_kept":40,"cut":false,"hidden":false,"merged":[]}
["Aktivitetsnr.","Aktiviteter","Budgetteret "]
[1,"Nytårsmarch",0]
[2,"Hjertecafé",0]
[3,"Foredrag",0]
[4,"Hjertemotion",0]
[5,"Hjerteredderkursus (Giv Liv)",0]
[6,"Gå Med ",0]
[7,"Hjertesti",0]
[8,"Hverveaktiviteter (events og messer)",0]
[9,"Generalforsamling",0]
[10,"Bestyrelsesmøder",0]
[11,"Sommerarrangement (frivillige)",0]
[12,"Julearrangement (frivillige)",0]
[13,"Samarbejde med andre",0]
[14,"Kontingenter",0]
[15,"Udgifter til bankkonto, gebyrer",0]
[16,"Kontorhold",0]
[17,"Gaver ",0]
[18,"Frivilliggodtgørelse (telefon og internet)",0]
[19,"Øvrige",0]
{"$rows_left_out":21}
{"sheet":"Bogføring 2026","index":4,"n_rows":501,"n_cols":24,"rows_kept":501,"cut":false,"hidden":false,"merged":[]}
["Region","Lokalforening","Kassererens Navn","Kassererens e-mail-adresse","Regnskab sendt dato","Afleveret","Bilagsnr.","Dato","Præcis bilagstekst","Beløb","Saldo","Kontotypenr.","Kontotype","Aktivitetsnr.","Aktivitet","Sponsor-navn","Indtægt","Udgift",null,null,"Kontotypenr.","Kontotype","Aktivitetsnr.","Aktiviteter"]
[null,null,null,null,null,null,null,null,null,null,null,null,null,null,null,null,null,null,null,null,100,"Annoncer",1,{"$f":"IF('Budget 2026'!B2<>\"(Skriv og erstat)\",VLOOKUP('Bogføring 2026'!W2,'Budget 2026'!A2:B43,2,FALSE),\"\")","v":"Nytårsmarch"}]
[{"$f":"Forside!C5","v":0},{"$f":"Forside!C6","v":0},{"$f":"Forside!C7","v":0},{"$f":"Forside!C8","v":0},{"$f":"Forside!C9","v":"00:00:00"},{"$f":"Forside!C10","v":"Elektronisk"},null,null,null,null,{"$f":"IF(_xlfn.NUMBERVALUE(J3),K2+J3,\"\")","v":""},null,{"$f":"IF(ISNA(VLOOKUP(L3,$U$1:$V$40,2,FALSE)),\"\",VLOOKUP(L3,$U$1:$V$40,2,FALSE))","v":""},null,{"$f":"IF(ISNA(VLOOKUP(N3,$W$1:$X$40,2,FALSE)),\"\",VLOOKUP(N3,$W$1:$X$40,2,FALSE))","v":""},null,{"$f":"IF(J3>0,J3,0)","v":0},{"$f":"IF(J3<0,J3,0)","v":0},null,null,110,"Transport og kørsel",2,{"$f":"IF('Budget 2026'!B3<>\"(Skriv og erstat)\",VLOOKUP('Bogføring 2026'!W3,'Budget 2026'!A3:B44,2,FALSE),\"\")","v":"Hjertecafé"}]
[{"$f":"A3","v":0},0,0,0,"00:00:00","Elektronisk",null,null,null,null,"",null,{"$f":"IF(ISNA(VLOOKUP(L4,$U$1:$V$40,2,FALSE)),\"\",VLOOKUP(L4,$U$1:$V$40,2,FALSE))","v":""},null,"",null,{"$f":"IF(J4>0,J4,0)","v":0},{"$f":"IF(J4<0,J4,0)","v":0},null,null,120,"Tryksager",3,{"$f":"IF('Budget 2026'!B4<>\"(Skriv og erstat)\",VLOOKUP('Bogføring 2026'!W4,'Budget 2026'!A4:B45,2,FALSE),\"\")","v":"Foredrag"}]
[{"$f":"A4","v":0},0,0,0,"00:00:00","Elektronisk",null,null,null,null,"",null,"",null,"",null,{"$f":"IF(J5>0,J5,0)","v":0},{"$f":"IF(J5<0,J5,0)","v":0},null,null,130,"Forplejning",4,{"$f":"IF('Budget 2026'!B5<>\"(Skriv og erstat)\",VLOOKUP('Bogføring 2026'!W5,'Budget 2026'!A5:B46,2,FALSE),\"\")","v":"Hjertemotion"}]
[{"$f":"A5","v":0},0,0,0,"00:00:00","Elektronisk",null,null,null,null,"",null,"",null,"",null,0,0,null,null,140,"Kontorhold",5,{"$f":"IF('Budget 2026'!B6<>\"(Skriv og erstat)\",VLOOKUP('Bogføring 2026'!W6,'Budget 2026'!A6:B47,2,FALSE),\"\")","v":"Hjerteredderkursus (Giv Liv)"}]
[{"$f":"A6","v":0},0,0,0,"00:00:00","Elektronisk",null,null,null,null,"",null,"",null,"",null,0,0,null,null,150,"Gaver",6,{"$f":"IF('Budget 2026'!B7<>\"(Skriv og erstat)\",VLOOKUP('Bogføring 2026'!W7,'Budget 2026'!A7:B48,2,FALSE),\"\")","v":"Gå Med "}]
[{"$f":"A7","v":0},0,0,0,"00:00:00","Elektronisk",null,null,null,null,"",null,"",null,"",null,0,0,null,null,160,"Løn og honorar",7,{"$f":"IF('Budget 2026'!B8<>\"(Skriv og erstat)\",VLOOKUP('Bogføring 2026'!W8,'Budget 2026'!A8:B49,2,FALSE),\"\")","v":"Hjertesti"}]
[{"$f":"A8","v":0},0,0,0,"00:00:00","Elektronisk",null,null,null,null,"",null,"",null,"",null,0,0,null,null,170,"Lokaleleje",8,{"$f":"IF('Budget 2026'!B9<>\"(Skriv og erstat)\",VLOOKUP('Bogføring 2026'!W9,'Budget 2026'!A9:B50,2,FALSE),\"\")","v":"Hverveaktiviteter (events og messer)"}]
[{"$f":"A9","v":0},0,0,0,"00:00:00","Elektronisk",null,null,null,null,"",null,"",null,"",null,0,0,null,null,180,"Materialer",9,{"$f":"IF('Budget 2026'!B10<>\"(Skriv og erstat)\",VLOOKUP('Bogføring 2026'!W10,'Budget 2026'!A10:B51,2,FALSE),\"\")","v":"Generalforsamling"}]
[{"$f":"A10","v":0},0,0,0,"00:00:00","Elektronisk",null,null,null,null,"",null,"",null,"",null,0,0,null,null,190,"Licens og software",10,{"$f":"IF('Budget 2026'!B11<>\"(Skriv og erstat)\",VLOOKUP('Bogføring 2026'!W11,'Budget 2026'!A11:B52,2,FALSE),\"\")","v":"Bestyrelsesmøder"}]
[{"$f":"A11","v":0},0,0,0,"00:00:00","Elektronisk",null,null,null,null,"",null,"",null,"",null,0,0,null,null,200,"Varekøb til videresalg ",11,{"$f":"IF('Budget 2026'!B12<>\"(Skriv og erstat)\",VLOOKUP('Bogføring 2026'!W12,'Budget 2026'!A12:B53,2,FALSE),\"\")","v":"Sommerarrangement (frivillige)"}]
[{"$f":"A12","v":0},0,0,0,"00:00:00","Elektronisk",null,null,null,null,"",null,"",null,"",null,0,0,null,null,210,"Værnemidler",12,{"$f":"IF('Budget 2026'!B13<>\"(Skriv og erstat)\",VLOOKUP('Bogføring 2026'!W13,'Budget 2026'!A13:B54,2,FALSE),\"\")","v":"Julearrangement (frivillige)"}]
[{"$f":"A13","v":0},0,0,0,"00:00:00","Elektronisk",null,null,null,null,"",null,"",null,"",null,0,0,null,null,220,"Udgifter til bank",13,{"$f":"IF('Budget 2026'!B14<>\"(Skriv og erstat)\",VLOOKUP('Bogføring 2026'!W14,'Budget 2026'!A14:B55,2,FALSE),\"\")","v":"Samarbejde med andre"}]
[{"$f":"A14","v":0},0,0,0,"00:00:00","Elektronisk",null,null,null,null,"",null,"",null,"",null,{"$f":"IF(J15>0,J15,0)","v":0},0,null,null,230,"Periodisering",14,{"$f":"IF('Budget 2026'!B15<>\"(Skriv og erstat)\",VLOOKUP('Bogføring 2026'!W15,'Budget 2026'!A15:B56,2,FALSE),\"\")","v":"Kontingenter"}]
[{"$f":"A15","v":0},0,0,0,"00:00:00","Elektronisk",null,null,null,null,"",null,"",null,"",null,0,0,null,null,240,"Øvrige",15,{"$f":"IF('Budget 2026'!B16<>\"(Skriv og erstat)\",VLOOKUP('Bogføring 2026'!W16,'Budget 2026'!A16:B57,2,FALSE),\"\")","v":"Udgifter til bankkonto, gebyrer"}]
[{"$f":"A16","v":0},0,0,0,"00:00:00","Elektronisk",null,null,null,null,"",null,"",null,"",null,0,0,null,null,null,null,16,{"$f":"IF('Budget 2026'!B17<>\"(Skriv og erstat)\",VLOOKUP('Bogføring 2026'!W17,'Budget 2026'!A17:B58,2,FALSE),\"\")","v":"Kontorhold"}]
[{"$f":"A17","v":0},0,0,0,"00:00:00","Elektronisk",null,null,null,null,"",null,"",null,"",null,0,0,null,null,null,null,17,{"$f":"IF('Budget 2026'!B18<>\"(Skriv og erstat)\",VLOOKUP('Bogføring 2026'!W18,'Budget 2026'!A18:B59,2,FALSE),\"\")","v":"Gaver "}]
[{"$f":"A18","v":0},0,0,0,"00:00:00","Elektronisk",null,null,null,null,"",null,"",null,"",null,0,0,null,null,300,"Tilskud fra HF (indtægt)",18,{"$f":"IF('Budget 2026'!B19<>\"(Skriv og erstat)\",VLOOKUP('Bogføring 2026'!W19,'Budget 2026'!A19:B60,2,FALSE),\"\")","v":"Frivilliggodtgørelse (telefon og internet)"}]
[{"$f":"A19","v":0},0,0,0,"00:00:00","Elektronisk",null,null,null,null,"",null,"",null,"",null,0,0,null,null,310,"Sponsorater og donationer (indtægt)",19,{"$f":"IF('Budget 2026'!B20<>\"(Skriv og erstat)\",VLOOKUP('Bogføring 2026'!W20,'Budget 2026'!A20:B61,2,FALSE),\"\")","v":"Øvrige"}]
{"$rows_left_out":482}
{"sheet":"Overblik årsregnskab","index":5,"n_rows":26,"n_cols":10,"rows_kept":26,"cut":false,"hidden":false,"merged":[[0,0,1,5],[0,7,1,9]]}
["Overblik årsregnskab",null,null,null,null,null,null,"Økonomisk overblik"]
[]
["Nr.","Aktivitet","Indtægter","Udgifter","Budgetteret","Rest budget"]
[1,"Nytårsmarch",null,null,0,0,null,"Økonomisk status"]
[2,"Hjertecafé",null,null,0,0,null,"Åbningssaldo bank 1. jan. 2026",null,{"$f":"IF(_xlfn.NUMBERVALUE('Bogføring 2026'!K2),'Bogføring 2026'!K2,0)","v":0}]
[3,"Foredrag",null,null,0,0,null,"Beholdning bank pr. dags dato ",null,{"$f":"'Bogføring 2026'!J501","v":0}]
[4,"Hjertemotion",null,null,0,0,null,"Kontant beholdning (skriv selv beløb)"]
[5,"Hjerteredderkursus (Giv Liv)",null,null,0,0,null,"Resultat",null,{"$f":"IF(_xlfn.NUMBERVALUE(J5),J6+J7,\"\")","v":""}]
[6,"Gå Med",null,null,0,0]
[7,"Hjertesti",null,null,0,0]
[8,"Hverveaktiviteter (events og messer)",null,null,0,0,null,"Status for indtægter og udgifter"]
[9,"Generalforsamling",null,null,0,0,null,"Indtægter til dags dato",null,{"$f":"GETPIVOTDATA(\"[Measures].[Summen af Indtægt]\",$A$3)","v":0}]
[10,"Bestyrelsesmøder",null,null,0,0,null,"Udgifter til dags dato",null,{"$f":"GETPIVOTDATA(\"[Measures].[Summen af Udgift]\",$A$3)","v":0}]
[11,"Sommerarrangement (frivillige)",null,null,0,0,null,"Resultat",null,{"$f":"J12+J13","v":0}]
[12,"Julearrangement (frivillige)",null,null,0,0]
[13,"Samarbejde med andre",null,null,0,0]
[14,"Kontingenter",null,null,0,0,null,"Heraf periodiseret "]
[15,"Udgifter til bankkonto, gebyrer",null,null,0,0,null,"Forudbetalinger (periodisering)",null,{"$f":"SUMIF('Bogføring 2026'!O3:O500,'Bogføring 2026'!X22,'Bogføring 2026'!Q3:Q500)+SUMIF('Bogføring 2026'!O3:O500,'Bogføring 2026'!X22,'Bogføring 2026'!R3:R500)","v":0}]
[16,"Kontorhold",null,null,0,0,null,"Manglende omkostninger (ikke afholdt)",null,{"$f":"SUMIF('Bogføring 2026'!O3:O500,'Bogføring 2026'!X23,'Bogføring 2026'!Q3:Q500)+SUMIF('Bogføring 2026'!O3:O500,'Bogføring 2026'!X23,'Bogføring 2026'!R3:R500)","v":0}]
[17,"Gaver",null,null,0,0,null,"Resultat uden periodisering",null,{"$f":"J12+J13-J18-J19","v":0}]
{"$rows_left_out":7}
{"sheet":"Overblik sponsorater","index":6,"n_rows":14,"n_cols":15,"rows_kept":14,"cut":false,"hidden":false,"merged":[[0,0,1,5]]}
["Overblik sponsorater"]
[null,null,null,null,null,null,null,null,null,null,null,null,null,"Sponsor-navn","Vises"]
["Sponsor-navn","Aktivitet","Kontotype","Præcis bilagstekst","Indtægter","Udgifter","Rest-beløb",null,null,null,null,null,null,"§18","Ja"]
[null,null,null,null,null,null,null,null,null,null,null,null,null,"§79","Ja"]
[null,null,null,null,null,null,null,null,null,null,null,null,null,"ISOBRO","Ja"]
[null,null,null,null,null,null,null,null,null,null,null,null,null,"Menu"]
[null,null,null,null,null,null,null,null,null,null,null,null,null,"Lokal fond eller sponsor 2"]
[null,null,null,null,null,null,null,null,null,null,null,null,null,"Lokal fond eller sponsor 3","Ja"]
[null,null,null,null,null,null,null,null,null,null,null,null,null,"Lokal fond eller sponsor 4"]
[null,null,null,null,null,null,null,null,null,null,null,null,null,"Lokal fond eller sponsor 5"]
[null,null,null,null,null,null,null,null,null,null,null,null,null,"Lokal fond eller sponsor 6"]
[null,null,null,null,null,null,null,null,null,null,null,null,null,"Lokal fond eller sponsor 7"]
[null,null,null,null,null,null,null,null,null,null,null,null,null,"Lokal fond eller sponsor 8"]
[null,null,null,null,null,null,null,null,null,null,null,null,null,"Lokal fond eller sponsor 9"]

{"sheet":"Overblik kontotyper","index":7,"n_rows":5,"n_cols":7,"rows_kept":5,"cut":false,"hidden":false,"merged":[[0,0,1,6]]}
["Overblik kontoplan"]
[]
["Aktivitetsnr.","Aktiviteter","Kontotypenr.","Kontotype","Summen af Indtægt","Summen af Udgift","Resultat"]
["(tom)","(tom)","(tom)",null,0,0,0]
["Hovedtotal",null,null,null,0,0,0]

{"sheet":"Overblik årsregnskab gammel","index":8,"n_rows":41,"n_cols":10,"rows_kept":41,"cut":false,"hidden":true,"merged":[[49,0,49,4],[1,0,1,4],[1,7,1,9]]}
[]
["Årsregnskab - aktiviteter",null,null,null,null,null,null,"Økonomisk overblik"]
[null,null,"Værdier"]
["nr.","Aktiviteter","Indtægter","Udgifter"," Budgetteret","Rest budget",null,"Økonomisk status"]
[1,"Nytårsmarch",null,null,0,{"$f":"SUM(C5:E5)","v":0},null,"Åbningssaldo bank 1. jan. 2023",null,{"$f":"IF(_xlfn.NUMBERVALUE('Bogføring 2026'!K2),'Bogføring 2026'!K2,0)","v":0}]
[2,"Hjertecafé",null,null,0,0,null,"Beholdning bank pr. dags dato ",null,{"$f":"'Bogføring 2026'!J501","v":0}]
[3,"Foredrag",null,null,0,0,null,"Kontant beholdning (skriv selv beløb)"]
[4,"Hjertemotion",null,null,0,0,null,"Resultat",null,{"$f":"IF(_xlfn.NUMBERVALUE(J5),J6+J7,\"\")","v":""}]
[5,"Hjerteredderkursus (Giv Liv)",null,null,0,0]
[6,"Gå Med",null,null,0,0]
[7,"Hjertesti",null,null,0,0,null,"Status for indtægter og udgifter"]
[8,"Hverveaktiviteter (events og messer)",null,null,0,0,null,"Indtægter til dags dato",null,{"$f":"GETPIVOTDATA(\"[Measures].[Summen af Indtægt]\",$A$3)","v":0}]
[9,"Generalforsamling",null,null,0,0,null,"Udgifter til dags dato",null,{"$f":"GETPIVOTDATA(\"[Measures].[Summen af Udgift]\",$A$3)","v":0}]
[10,"Bestyrelsesmøder",null,null,0,0,null,"Resultat",null,{"$f":"J12+J13","v":0}]
[11,"Sommerarrangement (frivillige)",null,null,0,0]
[12,"Julearrangement (frivillige)",null,null,0,0]
[13,"Samarbejde med andre",null,null,0,0,null,"Heraf periodiseret "]
[14,"Kontingenter",null,null,0,0,null,"Forudbetalinger (periodisering)",null,{"$f":"SUMIF('Bogføring 2026'!O3:O500,'Bogføring 2026'!X22,'Bogføring 2026'!Q3:Q500)+SUMIF('Bogføring 2026'!O3:O500,'Bogføring 2026'!X22,'Bogføring 2026'!R3:R500)","v":0}]
[15,"Udgifter til bankkonto, gebyrer",null,null,0,0,null,"Manglende omkostninger (ikke afholdt)",null,{"$f":"SUMIF('Bogføring 2026'!O3:O500,'Bogføring 2026'!X23,'Bogføring 2026'!Q3:Q500)+SUMIF('Bogføring 2026'!O3:O500,'Bogføring 2026'!X23,'Bogføring 2026'!R3:R500)","v":0}]
[16,"Kontorhold",null,null,0,0,null,"Resultat uden periodisering",null,{"$f":"J12+J13-J18-J19","v":0}]
{"$rows_left_out":22}
{"sheet":"Overblik til print","index":9,"n_rows":25,"n_cols":14,"rows_kept":25,"cut":false,"hidden":true,"merged":[[0,5,0,7]]}
["Aktiviteter","Indtægter","Udgifter","Budgetteret",null,"Økonomisk overblik",null,null,null,null,"Aktiviteter","Indtægter","Udgifter","Budgetteret"]
["§18-midler og tilskud",null,null,0,null,null,null,null,null,null,"(tom)",null,null,0]
["Bestyrelsesmøder",null,null,0,null,"Økonomisk status",null,null,null,null,null,0,0,0]
["Foredrag",null,null,0,null,"Åbningssaldo bank 1. jan. 2022",null,{"$f":"IF(_xlfn.NUMBERVALUE('Bogføring 2026'!K2),'Bogføring 2026'!K2,0)","v":0},null,null,"Hovedtotal",0,0,0]
["Forudbetalinger (periodisering)",null,null,0,null,"Beholdning bank pr. dags dato ",null,{"$f":"'Bogføring 2026'!#REF!","v":{"$error":"#REF!"}}]
["Frivilliggodtgørelse (telefon og internet)",null,null,0,null,"Kontant beholdning (skriv selv beløb)"]
["Gaver",null,null,0,null,"Resultat",null,{"$f":"IF(_xlfn.NUMBERVALUE(H4),H5+H6,\"\")","v":""}]
["Generalforsamling",null,null,0]
["Gå Med",null,null,0]
["Hjertecafé",null,null,0,null,"Status for indtægter og udgifter"]
["Hjertemotion",null,null,0,null,"Indtægter til dags dato",null,{"$f":"GETPIVOTDATA(\"[Measures].[Summen af Indtægt]\",$A$1)","v":0}]
["Hjerteredderkursus (Giv Liv)",null,null,0,null,"Udgifter til dags dato",null,{"$f":"GETPIVOTDATA(\"[Measures].[Summen af Udgift]\",$A$1)","v":0}]
["Hjertesti",null,null,0,null,"Resultat",null,{"$f":"H11+H12","v":0}]
["Hverveaktiviteter (events og messer)",null,null,0]
["Julearrangement (frivillige)",null,null,0]
["Kontingenter",null,null,0]
["Kontorhold",null,null,0,null," "]
["Manglende omkostninger (ikke afholdt)",null,null,0]
["Nytårsmarch",null,null,0]
["Samarbejde med andre",null,null,0]
{"$rows_left_out":6}
{"sheet":"Kontoplan til print","index":10,"n_rows":40,"n_cols":4,"rows_kept":40,"cut":false,"hidden":false,"merged":[]}
["Kontotypenr.","Kontotype","Aktivitetsnr.","Aktiviteter"]
[100,"Annoncer",1,{"$f":"'Bogføring 2026'!X2","v":"Nytårsmarch"}]
[110,"Transport og kørsel",2,{"$f":"'Bogføring 2026'!X3","v":"Hjertecafé"}]
[120,"Tryksager",3,{"$f":"'Bogføring 2026'!X4","v":"Foredrag"}]
[130,"Forplejning",4,{"$f":"'Bogføring 2026'!X5","v":"Hjertemotion"}]
[140,"Kontorhold",5,{"$f":"'Bogføring 2026'!X6","v":"Hjerteredderkursus (Giv Liv)"}]
[150,"Gaver",6,{"$f":"'Bogføring 2026'!X7","v":"Gå Med "}]
[160,"Løn og honorar",7,{"$f":"'Bogføring 2026'!X8","v":"Hjertesti"}]
[170,"Lokaleleje",8,{"$f":"'Bogføring 2026'!X9","v":"Hverveaktiviteter (events og messer)"}]
[180,"Materialer",9,{"$f":"'Bogføring 2026'!X10","v":"Generalforsamling"}]
[190,"Licens og software",10,{"$f":"'Bogføring 2026'!X11","v":"Bestyrelsesmøder"}]
[200,"Varekøb til videresalg ",11,{"$f":"'Bogføring 2026'!X12","v":"Sommerarrangement (frivillige)"}]
[210,"Værnemidler",12,{"$f":"'Bogføring 2026'!X13","v":"Julearrangement (frivillige)"}]
[220,"Udgifter til bank",13,{"$f":"'Bogføring 2026'!X14","v":"Samarbejde med andre"}]
[230,"Periodisering",14,{"$f":"'Bogføring 2026'!X15","v":"Kontingenter"}]
[240,"Øvrige",15,{"$f":"'Bogføring 2026'!X16","v":"Udgifter til bankkonto, gebyrer"}]
[null,null,16,{"$f":"'Bogføring 2026'!X17","v":"Kontorhold"}]
[null,null,17,{"$f":"'Bogføring 2026'!X18","v":"Gaver "}]
[300,"Tilskud fra HF (indtægt)",18,{"$f":"'Bogføring 2026'!X19","v":"Frivilliggodtgørelse (telefon og internet)"}]
[310,"Sponsorater og donationer (indtægt)",19,{"$f":"'Bogføring 2026'!X20","v":"Øvrige"}]
{"$rows_left_out":21}
{"sheet":"Aktiviteter","index":11,"n_rows":40,"n_cols":2,"rows_kept":40,"cut":false,"hidden":true,"merged":[]}
[{"$f":"'Bogføring 2026'!W1:X40","v":"Aktivitetsnr."},"Aktiviteter"]
[1,"Nytårsmarch"]
[2,"Hjertecafé"]
[3,"Foredrag"]
[4,"Hjertemotion"]
[5,"Hjerteredderkursus (Giv Liv)"]
[6,"Gå Med "]
[7,"Hjertesti"]
[8,"Hverveaktiviteter (events og messer)"]
[9,"Generalforsamling"]
[10,"Bestyrelsesmøder"]
[11,"Sommerarrangement (frivillige)"]
[12,"Julearrangement (frivillige)"]
[13,"Samarbejde med andre"]
[14,"Kontingenter"]
[15,"Udgifter til bankkonto, gebyrer"]
[16,"Kontorhold"]
[17,"Gaver "]
[18,"Frivilliggodtgørelse (telefon og internet)"]
[19,"Øvrige"]
{"$rows_left_out":20}